https://build.openkylin.top/~cibot/+archive/openkylin/jenkins-ci-open-mr-8518/+build/287267
RUN: /usr/share/launchpad-buildd/bin/builder-prep 
Kernel version: Linux 484c181c4002 4.19.90-23.15.v2101.ky10.aarch64 #1 SMP Wed Sep 1 16:42:05 CST 2021 aarch64
Buildd toolchain package versions: launchpad-buildd_203~505~kylin18.04.1k4 python-lpbuildd_203~505~kylin18.04.1k4 python3-lpbuildd_203~505~kylin18.04.1k4 sbuild_0.67.0-2kord7 dpkg-dev_1.19.0.5ubuntu2.3 python-debian_0.1.32 python3-debian_0.1.32.
RUN: /usr/share/launchpad-buildd/bin/in-target unpack-chroot --backend=chroot --series=nile --arch=arm64 PACKAGEBUILD-287267 --image-type chroot /home/buildd/filecache-default/eb54a0701b7c2679f102a8bc52960599526151d3
Creating target for build PACKAGEBUILD-287267
RUN: /usr/share/launchpad-buildd/bin/in-target mount-chroot --backend=chroot --series=nile --arch=arm64 PACKAGEBUILD-287267
Starting target for build PACKAGEBUILD-287267
RUN: /usr/share/launchpad-buildd/bin/in-target override-sources-list --backend=chroot --series=nile --arch=arm64 PACKAGEBUILD-287267 'deb http://archive.build.openkylin.top/openkylin nile main' 'deb http://archive.build.openkylin.top/openkylin nile-security main' 'deb http://archive.build.openkylin.top/openkylin nile-updates main' 'deb http://archive.build.openkylin.top/openkylin nile-proposed main'
Can't find dpkg-alter package
Overriding sources.list in build-PACKAGEBUILD-287267
RUN: /usr/share/launchpad-buildd/bin/in-target add-trusted-keys --backend=chroot --series=nile --arch=arm64 PACKAGEBUILD-287267
Adding trusted keys to build-PACKAGEBUILD-287267
Warning: apt-key is deprecated. Manage keyring files in trusted.gpg.d instead (see apt-key(8)).
OK
Warning: apt-key is deprecated. Manage keyring files in trusted.gpg.d instead (see apt-key(8)).
/etc/apt/trusted.gpg.d/openkylin-archive-keyring.gpg
----------------------------------------------------
pub   rsa4096 2022-05-12 [SC] [expires: 2032-05-09]
      09FF C10E A273 DD29 A986  B110 8B31 3CEA FF59 2D96
uid           [ unknown] openKylin Archive Signing Key <release-team@openkylin.top>
sub   rsa4096 2022-05-12 [E] [expires: 2032-05-09]

/etc/apt/trusted.gpg.d/ubuntu-keyring-2012-archive.gpg
------------------------------------------------------
pub   rsa4096 2012-05-11 [SC]
      790B C727 7767 219C 42C8  6F93 3B4F E6AC C0B2 1F32
uid           [ unknown] Ubuntu Archive Automatic Signing Key (2012) <ftpmaster@ubuntu.com>

/etc/apt/trusted.gpg.d/ubuntu-keyring-2012-cdimage.gpg
------------------------------------------------------
pub   rsa4096 2012-05-11 [SC]
      8439 38DF 228D 22F7 B374  2BC0 D94A A3F0 EFE2 1092
uid           [ unknown] Ubuntu CD Image Automatic Signing Key (2012) <cdimage@ubuntu.com>

/etc/apt/trusted.gpg.d/ubuntu-keyring-2018-archive.gpg
------------------------------------------------------
pub   rsa4096 2018-09-17 [SC]
      F6EC B376 2474 EDA9 D21B  7022 8719 20D1 991B C93C
uid           [ unknown] Ubuntu Archive Automatic Signing Key (2018) <ftpmaster@ubuntu.com>

RUN: /usr/share/launchpad-buildd/bin/in-target update-debian-chroot --backend=chroot --series=nile --arch=arm64 PACKAGEBUILD-287267
Updating target for build PACKAGEBUILD-287267
Get:1 http://archive.build.openkylin.top/openkylin nile InRelease [43.5 kB]
Get:2 http://archive.build.openkylin.top/openkylin nile-security InRelease [43.5 kB]
Get:3 http://archive.build.openkylin.top/openkylin nile-updates InRelease [43.5 kB]
Get:4 http://archive.build.openkylin.top/openkylin nile-proposed InRelease [43.5 kB]
Get:5 http://archive.build.openkylin.top/OTHER/Internal-mirror/repack6/baseok0 nile InRelease [5617 B]
Get:6 http://archive.build.openkylin.top/OTHER/Internal-mirror/arm64-stage0 nile InRelease [2866 B]
Get:7 http://archive.build.openkylin.top/openkylin nile/main arm64 Packages [3152 kB]
Get:8 http://archive.build.openkylin.top/openkylin nile-proposed/main arm64 Packages [2829 kB]
Get:9 http://archive.build.openkylin.top/OTHER/Internal-mirror/repack6/baseok0 nile/main arm64 Packages [26.5 MB]
Get:10 http://archive.build.openkylin.top/OTHER/Internal-mirror/arm64-stage0 nile/main arm64 Packages [1542 B]
Fetched 32.7 MB in 6s (5326 kB/s)
Reading package lists...
Reading package lists...
Building dependency tree...
Reading state information...
Calculating upgrade...
The following packages were automatically installed and are no longer required:
  g++-9 libffi7 libhogweed5 libjson-c4 libnettle7 libperl5.30 libsepol1
  libssl1.1 libstdc++-9-dev lto-disabled-list perl-modules-5.30
Use 'sudo apt autoremove' to remove them.
The following packages will be REMOVED:
  libapt-pkg6.0* libgnutls30* libnpth0* libpng16-16* libssl3*
The following NEW packages will be installed:
  dmsetup libapt-pkg6.0t64 libffi8 libgnutls30t64 libhogweed6t64 libnettle8t64
  libnpth0t64 libpng16-16t64 libssl3t64 libunistring5
The following packages will be upgraded:
  apt base-files base-passwd binutils binutils-aarch64-linux-gnu
  binutils-common bsdutils coreutils debconf dpkg dpkg-dev fdisk gpg gpg-agent
  gpgconf gpgv libapparmor1 libbinutils libblkid1 libc-bin libc-dev-bin libc6
  libc6-dev libcryptsetup12 libctf-nobfd0 libctf0 libdebconfclient0
  libdevmapper1.02.1 libdpkg-perl libfdisk1 libgprofng0 libmount1 libnsl-dev
  libnsl2 libp11-kit0 libpam-modules libpam-modules-bin libpam-runtime
  libpam0g libseccomp2 libselinux1 libsframe1 libsmartcols1 libsqlite3-0
  libssl1.1 libsystemd-shared libsystemd0 libtasn1-6 libudev1 libuuid1
  libxxhash0 linux-libc-dev login lto-disabled-list make mawk mount openssl
  optipng passwd pinentry-curses pkgbinarymangler sensible-utils systemd
  systemd-dev systemd-sysv systemd-timesyncd tar ubuntu-keyring util-linux
  util-linux-extra zlib1g
72 upgraded, 10 newly installed, 5 to remove and 0 not upgraded.
Need to get 38.9 MB of archives.
After this operation, 15.6 MB of additional disk space will be used.
Get:1 http://archive.build.openkylin.top/openkylin nile/main arm64 libnsl-dev arm64 2.0.0-ok2 [28.7 kB]
Get:2 http://archive.build.openkylin.top/openkylin nile/main arm64 libc6-dev arm64 2.38-1ok6.9 [1415 kB]
Get:3 http://archive.build.openkylin.top/openkylin nile/main arm64 libc-dev-bin arm64 2.38-1ok6.9 [18.3 kB]
Get:4 http://archive.build.openkylin.top/openkylin nile/main arm64 libnsl2 arm64 2.0.0-ok2 [21.3 kB]
Get:5 http://archive.build.openkylin.top/openkylin nile-proposed/main arm64 linux-libc-dev arm64 6.6.0-15.0ok13 [1303 kB]
Get:6 http://archive.build.openkylin.top/openkylin nile/main arm64 libc6 arm64 2.38-1ok6.9 [2300 kB]
Get:7 http://archive.build.openkylin.top/openkylin nile/main arm64 base-files arm64 13-ok2.2 [57.9 kB]
Get:8 http://archive.build.openkylin.top/openkylin nile/main arm64 bsdutils arm64 1:2.39.3-ok2build5 [88.9 kB]
Get:9 http://archive.build.openkylin.top/openkylin nile/main arm64 coreutils arm64 9.4-ok3 [2752 kB]
Get:10 http://archive.build.openkylin.top/openkylin nile-proposed/main arm64 openssl arm64 3.2.1-ok7 [1251 kB]
Get:11 http://archive.build.openkylin.top/openkylin nile-proposed/main arm64 systemd-timesyncd arm64 255.2-ok1.12 [32.1 kB]
Get:12 http://archive.build.openkylin.top/openkylin nile/main arm64 libapparmor1 arm64 4.0.0-beta3-ok1 [31.4 kB]
Get:13 http://archive.build.openkylin.top/openkylin nile/main arm64 libblkid1 arm64 2.39.3-ok2build5 [110 kB]
Get:14 http://archive.build.openkylin.top/openkylin nile/main arm64 libselinux1 arm64 3.5-ok2 [68.6 kB]
Get:15 http://archive.build.openkylin.top/openkylin nile/main arm64 libmount1 arm64 2.39.3-ok2build5 [114 kB]
Get:16 http://archive.build.openkylin.top/openkylin nile/main arm64 debconf all 1.5.86-ok1 [119 kB]
Get:17 http://archive.build.openkylin.top/openkylin nile/main arm64 libpam0g arm64 1.5.3-ok7 [52.9 kB]
Get:18 http://archive.build.openkylin.top/openkylin nile/main arm64 libseccomp2 arm64 2.5.5-1ok1.3 [44.3 kB]
Get:19 http://archive.build.openkylin.top/openkylin nile/main arm64 libcryptsetup12 arm64 2:2.6.1-ok7 [193 kB]
Get:20 http://archive.build.openkylin.top/openkylin nile-proposed/main arm64 libssl3t64 arm64 3.2.1-ok7 [2271 kB]
Get:21 http://archive.build.openkylin.top/openkylin nile-proposed/main arm64 systemd-sysv arm64 255.2-ok1.12 [11.5 kB]
Get:22 http://archive.build.openkylin.top/openkylin nile-proposed/main arm64 systemd-dev all 255.2-ok1.12 [21.3 kB]
Get:23 http://archive.build.openkylin.top/openkylin nile-proposed/main arm64 systemd arm64 255.2-ok1.12 [3267 kB]
Get:24 http://archive.build.openkylin.top/openkylin nile-proposed/main arm64 libsystemd-shared arm64 255.2-ok1.12 [1677 kB]
Get:25 http://archive.build.openkylin.top/openkylin nile/main arm64 dmsetup arm64 2:1.02.196-ok2 [70.1 kB]
Get:26 http://archive.build.openkylin.top/openkylin nile-proposed/main arm64 libudev1 arm64 255.2-ok1.12 [78.9 kB]
Get:27 http://archive.build.openkylin.top/openkylin nile/main arm64 libdevmapper1.02.1 arm64 2:1.02.196-ok2 [109 kB]
Get:28 http://archive.build.openkylin.top/openkylin nile/main arm64 libuuid1 arm64 2.39.3-ok2build5 [33.3 kB]
Get:29 http://archive.build.openkylin.top/openkylin nile/main arm64 libfdisk1 arm64 2.39.3-ok2build5 [124 kB]
Get:30 http://archive.build.openkylin.top/openkylin nile/main arm64 mount arm64 2.39.3-ok2build5 [107 kB]
Get:31 http://archive.build.openkylin.top/openkylin nile-proposed/main arm64 libsystemd0 arm64 255.2-ok1.12 [296 kB]
Get:32 http://archive.build.openkylin.top/openkylin nile/main arm64 libxxhash0 arm64 0.8.2-ok1 [17.8 kB]
Get:33 http://archive.build.openkylin.top/openkylin nile/main arm64 zlib1g arm64 1:1.3.dfsg-ok3 [51.9 kB]
Get:34 http://archive.build.openkylin.top/openkylin nile/main arm64 libnettle8t64 arm64 3.9.1-ok2 [173 kB]
Get:35 http://archive.build.openkylin.top/openkylin nile/main arm64 libhogweed6t64 arm64 3.9.1-ok2 [193 kB]
Get:36 http://archive.build.openkylin.top/openkylin nile/main arm64 libunistring5 arm64 1.1-ok1 [543 kB]
Get:37 http://archive.build.openkylin.top/openkylin nile/main arm64 libgnutls30t64 arm64 3.8.3-ok3 [930 kB]
Get:38 http://archive.build.openkylin.top/openkylin nile/main arm64 libapt-pkg6.0t64 arm64 2.8.0-ok2 [769 kB]
Get:39 http://archive.build.openkylin.top/openkylin nile/main arm64 apt arm64 2.8.0-ok2 [1230 kB]
Get:40 http://archive.build.openkylin.top/openkylin nile/main arm64 tar arm64 1.35+dfsg-ok1 [553 kB]
Get:41 http://archive.build.openkylin.top/openkylin nile/main arm64 dpkg arm64 1.22.6-ok3 [1272 kB]
Get:42 http://archive.build.openkylin.top/openkylin nile/main arm64 login arm64 1:4.14.3-ok3.5 [453 kB]
Get:43 http://archive.build.openkylin.top/openkylin nile/main arm64 libsmartcols1 arm64 2.39.3-ok2build5 [58.2 kB]
Get:44 http://archive.build.openkylin.top/openkylin nile/main arm64 util-linux-extra arm64 2.39.3-ok2build5 [109 kB]
Get:45 http://archive.build.openkylin.top/openkylin nile/main arm64 util-linux arm64 2.39.3-ok2build5 [1033 kB]
Get:46 http://archive.build.openkylin.top/openkylin nile/main arm64 libdebconfclient0 arm64 0.271-ok1 [6268 B]
Get:47 http://archive.build.openkylin.top/openkylin nile/main arm64 base-passwd arm64 3.6.3-ok2 [48.6 kB]
Get:48 http://archive.build.openkylin.top/openkylin nile/main arm64 libc-bin arm64 2.38-1ok6.9 [502 kB]
Get:49 http://archive.build.openkylin.top/openkylin nile/main arm64 libffi8 arm64 3.4.6-ok2 [19.5 kB]
Get:50 http://archive.build.openkylin.top/openkylin nile/main arm64 libp11-kit0 arm64 0.25.3-ok1 [219 kB]
Get:51 http://archive.build.openkylin.top/openkylin nile/main arm64 libtasn1-6 arm64 4.19.0-ok1 [36.6 kB]
Get:52 http://archive.build.openkylin.top/openkylin nile/main arm64 libsqlite3-0 arm64 3.42.0-ok1 [576 kB]
Get:53 http://archive.build.openkylin.top/openkylin nile/main arm64 gpg arm64 2.4.3-ok11 [473 kB]
Get:54 http://archive.build.openkylin.top/openkylin nile/main arm64 gpg-agent arm64 2.4.3-ok11 [190 kB]
Get:55 http://archive.build.openkylin.top/openkylin nile/main arm64 gpgconf arm64 2.4.3-ok11 [84.9 kB]
Get:56 http://archive.build.openkylin.top/openkylin nile/main arm64 pinentry-curses arm64 1.2.1-3ok5 [29.5 kB]
Get:57 http://archive.build.openkylin.top/openkylin nile/main arm64 libnpth0t64 arm64 1.6-ok2 [7164 B]
Get:58 http://archive.build.openkylin.top/openkylin nile/main arm64 gpgv arm64 2.4.3-ok11 [129 kB]
Get:59 http://archive.build.openkylin.top/openkylin nile/main arm64 optipng arm64 0.7.8+ds-ok1 [96.6 kB]
Get:60 http://archive.build.openkylin.top/openkylin nile/main arm64 libpng16-16t64 arm64 1.6.43-ok1 [171 kB]
Get:61 http://archive.build.openkylin.top/openkylin nile/main arm64 libpam-modules-bin arm64 1.5.3-ok7 [45.9 kB]
Get:62 http://archive.build.openkylin.top/openkylin nile/main arm64 libpam-modules arm64 1.5.3-ok7 [259 kB]
Get:63 http://archive.build.openkylin.top/openkylin nile/main arm64 libpam-runtime all 1.5.3-ok7 [126 kB]
Get:64 http://archive.build.openkylin.top/openkylin nile/main arm64 passwd arm64 1:4.14.3-ok3.5 [771 kB]
Get:65 http://archive.build.openkylin.top/openkylin nile/main arm64 mawk arm64 1.3.4.20240123-ok1 [111 kB]
Get:66 http://archive.build.openkylin.top/openkylin nile/main arm64 sensible-utils all 0.0.22-ok1 [20.1 kB]
Get:67 http://archive.build.openkylin.top/openkylin nile/main arm64 fdisk arm64 2.39.3-ok2build5 [105 kB]
Get:68 http://archive.build.openkylin.top/openkylin nile/main arm64 ubuntu-keyring all 2023.11.28.1-ok1 [10.6 kB]
Get:69 http://archive.build.openkylin.top/openkylin nile/main arm64 libgprofng0 arm64 2.41-ok13 [689 kB]
Get:70 http://archive.build.openkylin.top/openkylin nile/main arm64 libctf0 arm64 2.41-ok13 [79.3 kB]
Get:71 http://archive.build.openkylin.top/openkylin nile/main arm64 libctf-nobfd0 arm64 2.41-ok13 [82.5 kB]
Get:72 http://archive.build.openkylin.top/openkylin nile/main arm64 binutils arm64 2.41-ok13 [17.1 kB]
Get:73 http://archive.build.openkylin.top/openkylin nile/main arm64 binutils-aarch64-linux-gnu arm64 2.41-ok13 [2392 kB]
Get:74 http://archive.build.openkylin.top/openkylin nile/main arm64 libbinutils arm64 2.41-ok13 [629 kB]
Get:75 http://archive.build.openkylin.top/openkylin nile/main arm64 binutils-common arm64 2.41-ok13 [2389 kB]
Get:76 http://archive.build.openkylin.top/openkylin nile/main arm64 libsframe1 arm64 2.41-ok13 [12.2 kB]
Get:77 http://archive.build.openkylin.top/openkylin nile/main arm64 dpkg-dev all 1.22.6-ok3 [1150 kB]
Get:78 http://archive.build.openkylin.top/openkylin nile/main arm64 libdpkg-perl all 1.22.6-ok3 [415 kB]
Get:79 http://archive.build.openkylin.top/openkylin nile/main arm64 make arm64 4.3-ok1 [332 kB]
Get:80 http://archive.build.openkylin.top/openkylin nile-proposed/main arm64 libssl1.1 arm64 1.1.1f-ok10 [1156 kB]
Get:81 http://archive.build.openkylin.top/openkylin nile/main arm64 lto-disabled-list all 24-ok21 [11.9 kB]
Get:82 http://archive.build.openkylin.top/openkylin nile/main arm64 pkgbinarymangler all 154-ok3 [14.9 kB]
debconf: delaying package configuration, since apt-utils is not installed
Fetched 38.9 MB in 1s (41.7 MB/s)
(Reading database ... 16009 files and directories currently installed.)
Preparing to unpack .../0-libnsl-dev_2.0.0-ok2_arm64.deb ...
Unpacking libnsl-dev:arm64 (2.0.0-ok2) over (2.0.0-ok1) ...
Preparing to unpack .../1-libc6-dev_2.38-1ok6.9_arm64.deb ...
Unpacking libc6-dev:arm64 (2.38-1ok6.9) over (2.38-1ok6.8) ...
Preparing to unpack .../2-libc-dev-bin_2.38-1ok6.9_arm64.deb ...
Unpacking libc-dev-bin (2.38-1ok6.9) over (2.38-1ok6.8) ...
Preparing to unpack .../3-libnsl2_2.0.0-ok2_arm64.deb ...
Unpacking libnsl2:arm64 (2.0.0-ok2) over (2.0.0-ok1) ...
Preparing to unpack .../4-linux-libc-dev_6.6.0-15.0ok13_arm64.deb ...
Unpacking linux-libc-dev:arm64 (6.6.0-15.0ok13) over (5.15.0-ok5) ...
Preparing to unpack .../5-libc6_2.38-1ok6.9_arm64.deb ...
Unpacking libc6:arm64 (2.38-1ok6.9) over (2.38-1ok6.8) ...
Setting up libc6:arm64 (2.38-1ok6.9) ...
(Reading database ... 16029 files and directories currently installed.)
Preparing to unpack .../base-files_13-ok2.2_arm64.deb ...
Unpacking base-files (13-ok2.2) over (11-ok14) ...
Setting up base-files (13-ok2.2) ...
Installing new version of config file /etc/issue ...
Installing new version of config file /etc/issue.net ...
Installing new version of config file /etc/lsb-release ...
(Reading database ... 16029 files and directories currently installed.)
Preparing to unpack .../bsdutils_1%3a2.39.3-ok2build5_arm64.deb ...
Unpacking bsdutils (1:2.39.3-ok2build5) over (1:2.38.1-ok5build1) ...
Setting up bsdutils (1:2.39.3-ok2build5) ...
(Reading database ... 16029 files and directories currently installed.)
Preparing to unpack .../coreutils_9.4-ok3_arm64.deb ...
Unpacking coreutils (9.4-ok3) over (8.30-ok3) ...
Setting up coreutils (9.4-ok3) ...
(Reading database ... 16165 files and directories currently installed.)
Preparing to unpack .../openssl_3.2.1-ok7_arm64.deb ...
Unpacking openssl (3.2.1-ok7) over (3.2.1-ok1) ...
Preparing to unpack .../systemd-timesyncd_255.2-ok1.12_arm64.deb ...
Unpacking systemd-timesyncd (255.2-ok1.12) over (253.5-ok1.1) ...
dpkg: warning: unable to delete old directory '/lib/systemd/ntp-units.d': Directory not empty
Preparing to unpack .../libapparmor1_4.0.0-beta3-ok1_arm64.deb ...
Unpacking libapparmor1:arm64 (4.0.0-beta3-ok1) over (2.13.3-ok1) ...
Preparing to unpack .../libblkid1_2.39.3-ok2build5_arm64.deb ...
Unpacking libblkid1:arm64 (2.39.3-ok2build5) over (2.38.1-ok5build1) ...
Setting up libblkid1:arm64 (2.39.3-ok2build5) ...
(Reading database ... 16162 files and directories currently installed.)
Preparing to unpack .../libselinux1_3.5-ok2_arm64.deb ...
Unpacking libselinux1:arm64 (3.5-ok2) over (3.5-ok1) ...
Setting up libselinux1:arm64 (3.5-ok2) ...
(Reading database ... 16162 files and directories currently installed.)
Preparing to unpack .../libmount1_2.39.3-ok2build5_arm64.deb ...
Unpacking libmount1:arm64 (2.39.3-ok2build5) over (2.38.1-ok5build1) ...
Setting up libmount1:arm64 (2.39.3-ok2build5) ...
(Reading database ... 16162 files and directories currently installed.)
Preparing to unpack .../debconf_1.5.86-ok1_all.deb ...
Unpacking debconf (1.5.86-ok1) over (1.5.73-ok1) ...
Setting up debconf (1.5.86-ok1) ...
Installing new version of config file /etc/debconf.conf ...
(Reading database ... 16160 files and directories currently installed.)
Preparing to unpack .../libpam0g_1.5.3-ok7_arm64.deb ...
Unpacking libpam0g:arm64 (1.5.3-ok7) over (1.5.3-ok4) ...
Setting up libpam0g:arm64 (1.5.3-ok7) ...
(Reading database ... 16159 files and directories currently installed.)
Preparing to unpack .../libseccomp2_2.5.5-1ok1.3_arm64.deb ...
Unpacking libseccomp2:arm64 (2.5.5-1ok1.3) over (2.5.3-ok1) ...
Setting up libseccomp2:arm64 (2.5.5-1ok1.3) ...
(Reading database ... 16159 files and directories currently installed.)
Preparing to unpack .../libcryptsetup12_2%3a2.6.1-ok7_arm64.deb ...
Unpacking libcryptsetup12:arm64 (2:2.6.1-ok7) over (2:2.6.1-ok3) ...
dpkg: libssl3:arm64: dependency problems, but removing anyway as you requested:
 systemd depends on libssl3 (>= 3.0.0).
 libsystemd-shared:arm64 depends on libssl3 (>= 3.0.0).
 libkrb5-3:arm64 depends on libssl3 (>= 3.0.0).
 libkmod2:arm64 depends on libssl3 (>= 3.0.0).

(Reading database ... 16158 files and directories currently installed.)
Removing libssl3:arm64 (3.2.1-ok1) ...
Selecting previously unselected package libssl3t64:arm64.
(Reading database ... 16147 files and directories currently installed.)
Preparing to unpack .../libssl3t64_3.2.1-ok7_arm64.deb ...
Unpacking libssl3t64:arm64 (3.2.1-ok7) ...
Preparing to unpack .../systemd-sysv_255.2-ok1.12_arm64.deb ...
Unpacking systemd-sysv (255.2-ok1.12) over (253.5-ok1.1) ...
Preparing to unpack .../systemd-dev_255.2-ok1.12_all.deb ...
Unpacking systemd-dev (255.2-ok1.12) over (255.2-ok1.1) ...
Setting up libssl3t64:arm64 (3.2.1-ok7) ...
(Reading database ... 16160 files and directories currently installed.)
Preparing to unpack .../systemd_255.2-ok1.12_arm64.deb ...
Unpacking systemd (255.2-ok1.12) over (253.5-ok1.1) ...
dpkg: warning: unable to delete old directory '/lib/systemd/system-preset': Directory not empty
dpkg: warning: unable to delete old directory '/lib/systemd/system-generators': Directory not empty
dpkg: warning: unable to delete old directory '/lib/systemd/system/user@0.service.d': Directory not empty
dpkg: warning: unable to delete old directory '/lib/systemd/system/user@.service.d': Directory not empty
dpkg: warning: unable to delete old directory '/lib/systemd/system/user-.slice.d': Directory not empty
dpkg: warning: unable to delete old directory '/lib/systemd/system/timers.target.wants': Directory not empty
dpkg: warning: unable to delete old directory '/lib/systemd/system/systemd-localed.service.d': Directory not empty
dpkg: warning: unable to delete old directory '/lib/systemd/system/sysinit.target.wants': Directory not empty
dpkg: warning: unable to delete old directory '/lib/systemd/system/sockets.target.wants': Directory not empty
dpkg: warning: unable to delete old directory '/lib/systemd/system/rescue.target.wants': Directory not empty
dpkg: warning: unable to delete old directory '/lib/systemd/system/rc-local.service.d': Directory not empty
dpkg: warning: unable to delete old directory '/lib/systemd/system/multi-user.target.wants': Directory not empty
dpkg: warning: unable to delete old directory '/lib/systemd/system/initrd.target.wants': Directory not empty
dpkg: warning: unable to delete old directory '/lib/systemd/system/initrd-root-fs.target.wants': Directory not empty
dpkg: warning: unable to delete old directory '/lib/systemd/system/initrd-root-device.target.wants': Directory not empty
dpkg: warning: unable to delete old directory '/lib/systemd/system/graphical.target.wants': Directory not empty
dpkg: warning: unable to delete old directory '/lib/systemd/system/getty.target.wants': Directory not empty
dpkg: warning: unable to delete old directory '/lib/systemd/network': Directory not empty
dpkg: warning: unable to delete old directory '/lib/systemd/journald.conf.d': Directory not empty
dpkg: warning: unable to delete old directory '/lib/modprobe.d': Directory not empty
dpkg: warning: unable to delete old directory '/lib/lsb/init-functions.d': Directory not empty
dpkg: warning: unable to delete old directory '/lib/lsb': Directory not empty
Preparing to unpack .../libsystemd-shared_255.2-ok1.12_arm64.deb ...
Unpacking libsystemd-shared:arm64 (255.2-ok1.12) over (253.5-ok1.1) ...
Selecting previously unselected package dmsetup.
Preparing to unpack .../dmsetup_2%3a1.02.196-ok2_arm64.deb ...
Unpacking dmsetup (2:1.02.196-ok2) ...
Preparing to unpack .../libudev1_255.2-ok1.12_arm64.deb ...
Unpacking libudev1:arm64 (255.2-ok1.12) over (253.5-ok1.1) ...
Setting up libudev1:arm64 (255.2-ok1.12) ...
(Reading database ... 16299 files and directories currently installed.)
Preparing to unpack .../libdevmapper1.02.1_2%3a1.02.196-ok2_arm64.deb ...
Unpacking libdevmapper1.02.1:arm64 (2:1.02.196-ok2) over (2:1.02.167-ok1) ...
Preparing to unpack .../libuuid1_2.39.3-ok2build5_arm64.deb ...
Unpacking libuuid1:arm64 (2.39.3-ok2build5) over (2.38.1-ok5build1) ...
Setting up libuuid1:arm64 (2.39.3-ok2build5) ...
(Reading database ... 16299 files and directories currently installed.)
Preparing to unpack .../libfdisk1_2.39.3-ok2build5_arm64.deb ...
Unpacking libfdisk1:arm64 (2.39.3-ok2build5) over (2.38.1-ok5build1) ...
Preparing to unpack .../mount_2.39.3-ok2build5_arm64.deb ...
Unpacking mount (2.39.3-ok2build5) over (2.38.1-ok5build1) ...
Preparing to unpack .../libsystemd0_255.2-ok1.12_arm64.deb ...
Unpacking libsystemd0:arm64 (255.2-ok1.12) over (253.5-ok1.1) ...
Setting up libsystemd0:arm64 (255.2-ok1.12) ...
(Reading database ... 16298 files and directories currently installed.)
Preparing to unpack .../libxxhash0_0.8.2-ok1_arm64.deb ...
Unpacking libxxhash0:arm64 (0.8.2-ok1) over (0.8.1-ok1) ...
Setting up libxxhash0:arm64 (0.8.2-ok1) ...
(Reading database ... 16298 files and directories currently installed.)
Preparing to unpack .../zlib1g_1%3a1.3.dfsg-ok3_arm64.deb ...
Unpacking zlib1g:arm64 (1:1.3.dfsg-ok3) over (1:1.3.dfsg-ok2) ...
Setting up zlib1g:arm64 (1:1.3.dfsg-ok3) ...
Selecting previously unselected package libnettle8t64:arm64.
(Reading database ... 16298 files and directories currently installed.)
Preparing to unpack .../libnettle8t64_3.9.1-ok2_arm64.deb ...
Unpacking libnettle8t64:arm64 (3.9.1-ok2) ...
Setting up libnettle8t64:arm64 (3.9.1-ok2) ...
Selecting previously unselected package libhogweed6t64:arm64.
(Reading database ... 16306 files and directories currently installed.)
Preparing to unpack .../libhogweed6t64_3.9.1-ok2_arm64.deb ...
Unpacking libhogweed6t64:arm64 (3.9.1-ok2) ...
Setting up libhogweed6t64:arm64 (3.9.1-ok2) ...
Selecting previously unselected package libunistring5:arm64.
(Reading database ... 16312 files and directories currently installed.)
Preparing to unpack .../libunistring5_1.1-ok1_arm64.deb ...
Unpacking libunistring5:arm64 (1.1-ok1) ...
Setting up libunistring5:arm64 (1.1-ok1) ...
dpkg: libgnutls30:arm64: dependency problems, but removing anyway as you requested:
 apt depends on libgnutls30 (>= 3.6.12).

(Reading database ... 16317 files and directories currently installed.)
Removing libgnutls30:arm64 (3.6.13-ok3) ...
Selecting previously unselected package libgnutls30t64:arm64.
(Reading database ... 16307 files and directories currently installed.)
Preparing to unpack .../libgnutls30t64_3.8.3-ok3_arm64.deb ...
Unpacking libgnutls30t64:arm64 (3.8.3-ok3) ...
Setting up libgnutls30t64:arm64 (3.8.3-ok3) ...
dpkg: libapt-pkg6.0:arm64: dependency problems, but removing anyway as you requested:
 apt depends on libapt-pkg6.0 (>= 2.7.3-ok3).

(Reading database ... 16335 files and directories currently installed.)
Removing libapt-pkg6.0:arm64 (2.7.3-ok3) ...
Selecting previously unselected package libapt-pkg6.0t64:arm64.
(Reading database ... 16286 files and directories currently installed.)
Preparing to unpack .../libapt-pkg6.0t64_2.8.0-ok2_arm64.deb ...
Unpacking libapt-pkg6.0t64:arm64 (2.8.0-ok2) ...
Setting up libapt-pkg6.0t64:arm64 (2.8.0-ok2) ...
(Reading database ... 16336 files and directories currently installed.)
Preparing to unpack .../apt_2.8.0-ok2_arm64.deb ...
Unpacking apt (2.8.0-ok2) over (2.7.3-ok3) ...
Setting up apt (2.8.0-ok2) ...
(Reading database ... 16336 files and directories currently installed.)
Preparing to unpack .../tar_1.35+dfsg-ok1_arm64.deb ...
Unpacking tar (1.35+dfsg-ok1) over (1.30+dfsg-ok4) ...
Setting up tar (1.35+dfsg-ok1) ...
(Reading database ... 16337 files and directories currently installed.)
Preparing to unpack .../dpkg_1.22.6-ok3_arm64.deb ...
Unpacking dpkg (1.22.6-ok3) over (1.22.6-ok2) ...
Setting up dpkg (1.22.6-ok3) ...
dpkg: warning: This system uses merged-usr-via-aliased-dirs, going behind dpkg's
dpkg: warning: back, breaking its core assumptions. This can cause silent file
dpkg: warning: overwrites and disappearances, and its general tools misbehavior.
dpkg: warning: See <https://wiki.debian.org/Teams/Dpkg/FAQ#broken-usrmerge>.
(Reading database ... 16337 files and directories currently installed.)
Preparing to unpack .../login_1%3a4.14.3-ok3.5_arm64.deb ...
Unpacking login (1:4.14.3-ok3.5) over (1:4.14.3-ok3) ...
Setting up login (1:4.14.3-ok3.5) ...
(Reading database ... 16336 files and directories currently installed.)
Preparing to unpack .../libsmartcols1_2.39.3-ok2build5_arm64.deb ...
Unpacking libsmartcols1:arm64 (2.39.3-ok2build5) over (2.38.1-ok5build1) ...
Setting up libsmartcols1:arm64 (2.39.3-ok2build5) ...
(Reading database ... 16336 files and directories currently installed.)
Preparing to unpack .../util-linux-extra_2.39.3-ok2build5_arm64.deb ...
Unpacking util-linux-extra (2.39.3-ok2build5) over (2.38.1-ok5build1) ...
Setting up util-linux-extra (2.39.3-ok2build5) ...
(Reading database ... 16345 files and directories currently installed.)
Preparing to unpack .../util-linux_2.39.3-ok2build5_arm64.deb ...
Unpacking util-linux (2.39.3-ok2build5) over (2.38.1-ok5build1) ...
Setting up util-linux (2.39.3-ok2build5) ...
(Reading database ... 16348 files and directories currently installed.)
Preparing to unpack .../libdebconfclient0_0.271-ok1_arm64.deb ...
Unpacking libdebconfclient0:arm64 (0.271-ok1) over (0.251-ok2) ...
Setting up libdebconfclient0:arm64 (0.271-ok1) ...
(Reading database ... 16348 files and directories currently installed.)
Preparing to unpack .../base-passwd_3.6.3-ok2_arm64.deb ...
Unpacking base-passwd (3.6.3-ok2) over (3.6.1-ok1) ...
Setting up base-passwd (3.6.3-ok2) ...
(Reading database ... 16348 files and directories currently installed.)
Preparing to unpack .../libc-bin_2.38-1ok6.9_arm64.deb ...
Unpacking libc-bin (2.38-1ok6.9) over (2.38-1ok6.8) ...
Setting up libc-bin (2.38-1ok6.9) ...
Selecting previously unselected package libffi8:arm64.
(Reading database ... 16348 files and directories currently installed.)
Preparing to unpack .../libffi8_3.4.6-ok2_arm64.deb ...
Unpacking libffi8:arm64 (3.4.6-ok2) ...
Setting up libffi8:arm64 (3.4.6-ok2) ...
(Reading database ... 16353 files and directories currently installed.)
Preparing to unpack .../libp11-kit0_0.25.3-ok1_arm64.deb ...
Unpacking libp11-kit0:arm64 (0.25.3-ok1) over (0.23.20-ok1) ...
Setting up libp11-kit0:arm64 (0.25.3-ok1) ...
(Reading database ... 16353 files and directories currently installed.)
Preparing to unpack .../libtasn1-6_4.19.0-ok1_arm64.deb ...
Unpacking libtasn1-6:arm64 (4.19.0-ok1) over (4.16.0-ok2) ...
Setting up libtasn1-6:arm64 (4.19.0-ok1) ...
(Reading database ... 16353 files and directories currently installed.)
Preparing to unpack .../libsqlite3-0_3.42.0-ok1_arm64.deb ...
Unpacking libsqlite3-0:arm64 (3.42.0-ok1) over (3.39.4-ok3) ...
Preparing to unpack .../gpg_2.4.3-ok11_arm64.deb ...
Unpacking gpg (2.4.3-ok11) over (2.2.19-ok1) ...
Preparing to unpack .../gpg-agent_2.4.3-ok11_arm64.deb ...
Unpacking gpg-agent (2.4.3-ok11) over (2.2.19-ok1) ...
Preparing to unpack .../gpgconf_2.4.3-ok11_arm64.deb ...
Unpacking gpgconf (2.4.3-ok11) over (2.2.19-ok1) ...
Preparing to unpack .../pinentry-curses_1.2.1-3ok5_arm64.deb ...
Unpacking pinentry-curses (1.2.1-3ok5) over (1.1.0-ok1) ...
(Reading database ... 16352 files and directories currently installed.)
Removing libnpth0:arm64 (1.6-ok1) ...
Selecting previously unselected package libnpth0t64:arm64.
(Reading database ... 16347 files and directories currently installed.)
Preparing to unpack .../libnpth0t64_1.6-ok2_arm64.deb ...
Unpacking libnpth0t64:arm64 (1.6-ok2) ...
Setting up libnpth0t64:arm64 (1.6-ok2) ...
(Reading database ... 16353 files and directories currently installed.)
Preparing to unpack .../gpgv_2.4.3-ok11_arm64.deb ...
Unpacking gpgv (2.4.3-ok11) over (2.2.19-ok1) ...
Setting up gpgv (2.4.3-ok11) ...
(Reading database ... 16353 files and directories currently installed.)
Preparing to unpack .../optipng_0.7.8+ds-ok1_arm64.deb ...
Unpacking optipng (0.7.8+ds-ok1) over (0.7.8+ds-ok0) ...
(Reading database ... 16353 files and directories currently installed.)
Removing libpng16-16:arm64 (1.6.37-ok1) ...
Selecting previously unselected package libpng16-16t64:arm64.
(Reading database ... 16343 files and directories currently installed.)
Preparing to unpack .../libpng16-16t64_1.6.43-ok1_arm64.deb ...
Unpacking libpng16-16t64:arm64 (1.6.43-ok1) ...
Preparing to unpack .../libpam-modules-bin_1.5.3-ok7_arm64.deb ...
Unpacking libpam-modules-bin (1.5.3-ok7) over (1.5.3-ok4) ...
Setting up libpam-modules-bin (1.5.3-ok7) ...
(Reading database ... 16353 files and directories currently installed.)
Preparing to unpack .../libpam-modules_1.5.3-ok7_arm64.deb ...
Unpacking libpam-modules:arm64 (1.5.3-ok7) over (1.5.3-ok4) ...
Setting up libpam-modules:arm64 (1.5.3-ok7) ...
(Reading database ... 16352 files and directories currently installed.)
Preparing to unpack .../libpam-runtime_1.5.3-ok7_all.deb ...
Unpacking libpam-runtime (1.5.3-ok7) over (1.5.3-ok4) ...
Setting up libpam-runtime (1.5.3-ok7) ...
(Reading database ... 16349 files and directories currently installed.)
Preparing to unpack .../passwd_1%3a4.14.3-ok3.5_arm64.deb ...
Unpacking passwd (1:4.14.3-ok3.5) over (1:4.13+dfsg1-ok0) ...
Setting up passwd (1:4.14.3-ok3.5) ...
(Reading database ... 16345 files and directories currently installed.)
Preparing to unpack .../00-mawk_1.3.4.20240123-ok1_arm64.deb ...
Unpacking mawk (1.3.4.20240123-ok1) over (1.3.4.20200120-ok1) ...
Preparing to unpack .../01-sensible-utils_0.0.22-ok1_all.deb ...
Unpacking sensible-utils (0.0.22-ok1) over (0.0.12-ok1) ...
Preparing to unpack .../02-fdisk_2.39.3-ok2build5_arm64.deb ...
Unpacking fdisk (2.39.3-ok2build5) over (2.38.1-ok5build1) ...
Preparing to unpack .../03-ubuntu-keyring_2023.11.28.1-ok1_all.deb ...
Unpacking ubuntu-keyring (2023.11.28.1-ok1) over (2020.02.11.2-ok2) ...
Preparing to unpack .../04-libgprofng0_2.41-ok13_arm64.deb ...
Unpacking libgprofng0:arm64 (2.41-ok13) over (2.41-5ok12) ...
Preparing to unpack .../05-libctf0_2.41-ok13_arm64.deb ...
Unpacking libctf0:arm64 (2.41-ok13) over (2.41-5ok12) ...
Preparing to unpack .../06-libctf-nobfd0_2.41-ok13_arm64.deb ...
Unpacking libctf-nobfd0:arm64 (2.41-ok13) over (2.41-5ok12) ...
Preparing to unpack .../07-binutils_2.41-ok13_arm64.deb ...
Unpacking binutils (2.41-ok13) over (2.41-5ok12) ...
Preparing to unpack .../08-binutils-aarch64-linux-gnu_2.41-ok13_arm64.deb ...
Unpacking binutils-aarch64-linux-gnu (2.41-ok13) over (2.41-5ok12) ...
Preparing to unpack .../09-libbinutils_2.41-ok13_arm64.deb ...
Unpacking libbinutils:arm64 (2.41-ok13) over (2.41-5ok12) ...
Preparing to unpack .../10-binutils-common_2.41-ok13_arm64.deb ...
Unpacking binutils-common:arm64 (2.41-ok13) over (2.41-5ok12) ...
Preparing to unpack .../11-libsframe1_2.41-ok13_arm64.deb ...
Unpacking libsframe1:arm64 (2.41-ok13) over (2.41-5ok12) ...
Preparing to unpack .../12-dpkg-dev_1.22.6-ok3_all.deb ...
Unpacking dpkg-dev (1.22.6-ok3) over (1.22.6-ok2) ...
Preparing to unpack .../13-libdpkg-perl_1.22.6-ok3_all.deb ...
Unpacking libdpkg-perl (1.22.6-ok3) over (1.22.6-ok2) ...
Preparing to unpack .../14-make_4.3-ok1_arm64.deb ...
Unpacking make (4.3-ok1) over (4.2.1-ok1) ...
Preparing to unpack .../15-libssl1.1_1.1.1f-ok10_arm64.deb ...
Unpacking libssl1.1:arm64 (1.1.1f-ok10) over (1.1.1f-ok3) ...
Preparing to unpack .../16-lto-disabled-list_24-ok21_all.deb ...
Unpacking lto-disabled-list (24-ok21) over (24-ok20) ...
Preparing to unpack .../17-pkgbinarymangler_154-ok3_all.deb ...
Unpacking pkgbinarymangler (154-ok3) over (150-ok1) ...
Setting up pinentry-curses (1.2.1-3ok5) ...
Setting up lto-disabled-list (24-ok21) ...
Setting up libapparmor1:arm64 (4.0.0-beta3-ok1) ...
Setting up libssl1.1:arm64 (1.1.1f-ok10) ...
Setting up libsqlite3-0:arm64 (3.42.0-ok1) ...
Setting up binutils-common:arm64 (2.41-ok13) ...
Setting up linux-libc-dev:arm64 (6.6.0-15.0ok13) ...
Setting up libctf-nobfd0:arm64 (2.41-ok13) ...
Setting up systemd-dev (255.2-ok1.12) ...
Setting up ubuntu-keyring (2023.11.28.1-ok1) ...
Setting up libsframe1:arm64 (2.41-ok13) ...
Setting up make (4.3-ok1) ...
Setting up libpng16-16t64:arm64 (1.6.43-ok1) ...
Setting up libsystemd-shared:arm64 (255.2-ok1.12) ...
Setting up libdpkg-perl (1.22.6-ok3) ...
Setting up libfdisk1:arm64 (2.39.3-ok2build5) ...
Setting up mount (2.39.3-ok2build5) ...
Setting up sensible-utils (0.0.22-ok1) ...
Setting up libnsl2:arm64 (2.0.0-ok2) ...
Setting up gpgconf (2.4.3-ok11) ...
Setting up mawk (1.3.4.20240123-ok1) ...
Setting up libbinutils:arm64 (2.41-ok13) ...
Setting up libc-dev-bin (2.38-1ok6.9) ...
Setting up openssl (3.2.1-ok7) ...
Setting up gpg (2.4.3-ok11) ...
Setting up libctf0:arm64 (2.41-ok13) ...
Setting up gpg-agent (2.4.3-ok11) ...
Setting up fdisk (2.39.3-ok2build5) ...
Setting up libgprofng0:arm64 (2.41-ok13) ...
Setting up optipng (0.7.8+ds-ok1) ...
Setting up libnsl-dev:arm64 (2.0.0-ok2) ...
Setting up libc6-dev:arm64 (2.38-1ok6.9) ...
Setting up pkgbinarymangler (154-ok3) ...
Installing new version of config file /etc/pkgbinarymangler/maintainermangler.overrides ...
Installing new version of config file /etc/pkgbinarymangler/striptranslations.blacklist ...
Setting up binutils-aarch64-linux-gnu (2.41-ok13) ...
Setting up binutils (2.41-ok13) ...
Setting up dpkg-dev (1.22.6-ok3) ...
Setting up libdevmapper1.02.1:arm64 (2:1.02.196-ok2) ...
Setting up dmsetup (2:1.02.196-ok2) ...
Setting up libcryptsetup12:arm64 (2:2.6.1-ok7) ...
Setting up systemd (255.2-ok1.12) ...
Installing new version of config file /etc/systemd/journald.conf ...
Installing new version of config file /etc/systemd/logind.conf ...
Installing new version of config file /etc/systemd/networkd.conf ...
Installing new version of config file /etc/systemd/pstore.conf ...
Installing new version of config file /etc/systemd/sleep.conf ...
Installing new version of config file /etc/systemd/system.conf ...
Installing new version of config file /etc/systemd/user.conf ...
Setting up systemd-timesyncd (255.2-ok1.12) ...
Installing new version of config file /etc/dhcp/dhclient-exit-hooks.d/timesyncd ...
Installing new version of config file /etc/systemd/timesyncd.conf ...
Setting up systemd-sysv (255.2-ok1.12) ...
Processing triggers for libc-bin (2.38-1ok6.9) ...
(Reading database ... 16381 files and directories currently installed.)
Purging configuration files for libssl3:arm64 (3.2.1-ok1) ...
RUN: /usr/share/launchpad-buildd/bin/sbuild-package PACKAGEBUILD-287267 arm64 nile -c chroot:build-PACKAGEBUILD-287267 --arch=arm64 --dist=nile --nolog kylin-ai-model-manager_0.0.0.1-ok11.dsc
Initiating build PACKAGEBUILD-287267 with 8 jobs across 32 processor cores.
Kernel reported to sbuild: 4.19.90-23.15.v2101.ky10.aarch64 #1 SMP Wed Sep 1 16:42:05 CST 2021 aarch64
sbuild (Debian sbuild) 0.67.0 (26 Dec 2015) on 484c181c4002

+==============================================================================+
| kylin-ai-model-manager 0.0.0.1-ok11 (arm64)                06 Mar 2025 15:35 |
+==============================================================================+

Package: kylin-ai-model-manager
Version: 0.0.0.1-ok11
Source Version: 0.0.0.1-ok11
Distribution: nile
Machine Architecture: arm64
Host Architecture: arm64
Build Architecture: arm64

I: NOTICE: Log filtering will replace 'build/kylin-ai-model-manager-3P_81X/kylin-ai-model-manager-0.0.0.1' with '<<PKGBUILDDIR>>'
I: NOTICE: Log filtering will replace 'build/kylin-ai-model-manager-3P_81X' with '<<BUILDDIR>>'
I: NOTICE: Log filtering will replace 'home/buildd/build-PACKAGEBUILD-287267/chroot-autobuild' with '<<CHROOT>>'

+------------------------------------------------------------------------------+
| Fetch source files                                                           |
+------------------------------------------------------------------------------+


Local sources
-------------

kylin-ai-model-manager_0.0.0.1-ok11.dsc exists in .; copying to chroot

Check architectures
-------------------


Check dependencies
------------------

Merged Build-Depends: build-essential, fakeroot
Filtered Build-Depends: build-essential, fakeroot
dpkg-deb: building package 'sbuild-build-depends-core-dummy' in '/<<BUILDDIR>>/resolver-thHznB/apt_archive/sbuild-build-depends-core-dummy.deb'.
Ign:1 copy:/<<BUILDDIR>>/resolver-thHznB/apt_archive ./ InRelease
Get:2 copy:/<<BUILDDIR>>/resolver-thHznB/apt_archive ./ Release [2121 B]
Ign:3 copy:/<<BUILDDIR>>/resolver-thHznB/apt_archive ./ Release.gpg
Get:4 copy:/<<BUILDDIR>>/resolver-thHznB/apt_archive ./ Sources [214 B]
Get:5 copy:/<<BUILDDIR>>/resolver-thHznB/apt_archive ./ Packages [527 B]
Fetched 2862 B in 0s (90.7 kB/s)
Reading package lists...
Reading package lists...

+------------------------------------------------------------------------------+
| Install core build dependencies (apt-based resolver)                         |
+------------------------------------------------------------------------------+

Installing build dependencies
Reading package lists...
Building dependency tree...
Reading state information...
The following packages were automatically installed and are no longer required:
  g++-9 libffi7 libhogweed5 libjson-c4 libnettle7 libperl5.30 libsepol1
  libssl1.1 libstdc++-9-dev lto-disabled-list perl-modules-5.30
Use 'apt autoremove' to remove them.
The following NEW packages will be installed:
  sbuild-build-depends-core-dummy
0 upgraded, 1 newly installed, 0 to remove and 0 not upgraded.
Need to get 864 B of archives.
After this operation, 0 B of additional disk space will be used.
Get:1 copy:/<<BUILDDIR>>/resolver-thHznB/apt_archive ./ sbuild-build-depends-core-dummy 0.invalid.0 [864 B]
debconf: delaying package configuration, since apt-utils is not installed
Fetched 864 B in 0s (0 B/s)
Selecting previously unselected package sbuild-build-depends-core-dummy.
(Reading database ... 16381 files and directories currently installed.)
Preparing to unpack .../sbuild-build-depends-core-dummy_0.invalid.0_arm64.deb ...
Unpacking sbuild-build-depends-core-dummy (0.invalid.0) ...
Setting up sbuild-build-depends-core-dummy (0.invalid.0) ...
Merged Build-Depends: cmake, debhelper (>= 11~), qtbase5-dev
Filtered Build-Depends: cmake, debhelper (>= 11~), qtbase5-dev
dpkg-deb: building package 'sbuild-build-depends-kylin-ai-model-manager-dummy' in '/<<BUILDDIR>>/resolver-NE9d67/apt_archive/sbuild-build-depends-kylin-ai-model-manager-dummy.deb'.
Ign:1 copy:/<<BUILDDIR>>/resolver-NE9d67/apt_archive ./ InRelease
Get:2 copy:/<<BUILDDIR>>/resolver-NE9d67/apt_archive ./ Release [2121 B]
Ign:3 copy:/<<BUILDDIR>>/resolver-NE9d67/apt_archive ./ Release.gpg
Get:4 copy:/<<BUILDDIR>>/resolver-NE9d67/apt_archive ./ Sources [237 B]
Get:5 copy:/<<BUILDDIR>>/resolver-NE9d67/apt_archive ./ Packages [554 B]
Fetched 2912 B in 0s (102 kB/s)
Reading package lists...
Reading package lists...

+------------------------------------------------------------------------------+
| Install kylin-ai-model-manager build dependencies (apt-based resolver)       |
+------------------------------------------------------------------------------+

Installing build dependencies
Reading package lists...
Building dependency tree...
Reading state information...
The following packages were automatically installed and are no longer required:
  g++-9 libffi7 libjson-c4 libperl5.30 libsepol1 libssl1.1 libstdc++-9-dev
  lto-disabled-list perl-modules-5.30
Use 'apt autoremove' to remove them.
The following additional packages will be installed:
  autoconf automake autopoint autotools-dev bsdextrautils cmake cmake-data
  debhelper dh-autoreconf dh-strip-nondeterminism dwz file fontconfig
  fontconfig-config fonts-dejavu-core gettext gettext-base groff-base
  intltool-debian libarchive-zip-perl libarchive13t64 libavahi-client3
  libavahi-common-data libavahi-common3 libbrotli1 libcups2t64 libcurl4
  libdbus-1-3 libdebhelper-perl libdouble-conversion3 libdrm-amdgpu1
  libdrm-common libdrm-nouveau2 libdrm-radeon1 libdrm2 libedit2 libegl-dev
  libegl-mesa0 libegl1 libelf1t64 libevdev2 libexpat1
  libfile-stripnondeterminism-perl libfontconfig1 libfreetype6 libgbm1
  libgdbm6t64 libgl-dev libgl1 libgl1-mesa-dri libglapi-mesa libglib2.0-0t64
  libglu1-mesa libglu1-mesa-dev libglvnd0 libglx-dev libglx-mesa0 libglx0
  libgraphite2-3 libgudev-1.0-0 libharfbuzz0b libice6 libicu70 libicu74
  libinput-bin libinput10 libjpeg62-turbo libjsoncpp25 libldap2 libllvm17
  libmagic-mgc libmagic1t64 libmd4c0 libmtdev1t64 libnghttp2-14 libopengl-dev
  libopengl0 libpcre2-16-0 libpipeline1 libpsl5t64 libpthread-stubs0-dev
  libpython3-stdlib libpython3.12-minimal libpython3.12-stdlib
  libqt5concurrent5 libqt5core5a libqt5dbus5 libqt5gui5 libqt5network5
  libqt5printsupport5 libqt5sql5 libqt5test5 libqt5widgets5 libqt5xml5
  librhash0 librtmp1 libsasl2-2 libsasl2-modules-db libsensors-config
  libsensors5 libsm6 libssh2-1t64 libsub-override-perl libtool libuchardet0
  libuv1t64 libvulkan-dev libvulkan1 libwacom-common libwacom2
  libwayland-client0 libwayland-server0 libx11-6 libx11-data libx11-dev
  libx11-xcb1 libxau-dev libxau6 libxcb-dri2-0 libxcb-dri3-0 libxcb-glx0
  libxcb-icccm4 libxcb-image0 libxcb-keysyms1 libxcb-present0 libxcb-randr0
  libxcb-render-util0 libxcb-render0 libxcb-shape0 libxcb-shm0 libxcb-sync1
  libxcb-util1 libxcb-xfixes0 libxcb-xinerama0 libxcb-xinput0 libxcb-xkb1
  libxcb1 libxcb1-dev libxdmcp-dev libxdmcp6 libxext-dev libxext6 libxfixes3
  libxkbcommon-x11-0 libxkbcommon0 libxml2 libxrender1 libxshmfence1
  libxxf86vm1 m4 man-db media-types netbase po-debconf python3 python3-minimal
  python3.12 python3.12-minimal qt5-qmake qt5-qmake-bin qtbase5-dev
  qtbase5-dev-tools qtchooser shared-mime-info ucf x11-common
  x11proto-core-dev x11proto-dev xkb-data xorg-sgml-doctools xtrans-dev
Suggested packages:
  autoconf-archive gnu-standards autoconf-doc cmake-doc cmake-format
  elpa-cmake-mode ninja-build dh-make gettext-doc libasprintf-dev
  libgettextpo-dev groff lrzip cups-common gdbm-l10n low-memory-monitor
  libthai0 qgnomeplatform-qt5 qt5-image-formats-plugins lm-sensors libtool-doc
  gfortran | fortran95-compiler gcj-jdk libx11-doc libxcb-doc libxext-doc
  m4-doc apparmor less www-browser libmail-box-perl python3-doc python3-tk
  python3-venv python3.12-venv python3.12-doc binfmt-support
  default-libmysqlclient-dev firebird-dev libpq-dev libsqlite3-dev
  unixodbc-dev
Recommended packages:
  curl | wget | lynx dbus libarchive-cpio-perl libgl1-amber-dri
  libglib2.0-data xdg-user-dirs libldap-common publicsuffix
  qttranslations5-l10n libqt5svg5 qt5-gtk-platformtheme qtwayland5
  libqt5sql5-sqlite | libqt5sql5-mysql | libqt5sql5-odbc | libqt5sql5-psql
  | libqt5sql5-tds | libqt5sql5-ibase libsasl2-modules libltdl-dev
  mesa-vulkan-drivers | vulkan-icd libwacom-bin libmail-sendmail-perl
  libqt5opengl5-dev
The following packages will be REMOVED:
  libgdbm6*
The following NEW packages will be installed:
  autoconf automake autopoint autotools-dev bsdextrautils cmake cmake-data
  debhelper dh-autoreconf dh-strip-nondeterminism dwz file fontconfig
  fontconfig-config fonts-dejavu-core gettext gettext-base groff-base
  intltool-debian libarchive-zip-perl libarchive13t64 libavahi-client3
  libavahi-common-data libavahi-common3 libbrotli1 libcups2t64 libcurl4
  libdbus-1-3 libdebhelper-perl libdouble-conversion3 libdrm-amdgpu1
  libdrm-common libdrm-nouveau2 libdrm-radeon1 libdrm2 libedit2 libegl-dev
  libegl-mesa0 libegl1 libelf1t64 libevdev2 libexpat1
  libfile-stripnondeterminism-perl libfontconfig1 libfreetype6 libgbm1
  libgdbm6t64 libgl-dev libgl1 libgl1-mesa-dri libglapi-mesa libglib2.0-0t64
  libglu1-mesa libglu1-mesa-dev libglvnd0 libglx-dev libglx-mesa0 libglx0
  libgraphite2-3 libgudev-1.0-0 libharfbuzz0b libice6 libicu70 libicu74
  libinput-bin libinput10 libjpeg62-turbo libjsoncpp25 libldap2 libllvm17
  libmagic-mgc libmagic1t64 libmd4c0 libmtdev1t64 libnghttp2-14 libopengl-dev
  libopengl0 libpcre2-16-0 libpipeline1 libpsl5t64 libpthread-stubs0-dev
  libpython3-stdlib libpython3.12-minimal libpython3.12-stdlib
  libqt5concurrent5 libqt5core5a libqt5dbus5 libqt5gui5 libqt5network5
  libqt5printsupport5 libqt5sql5 libqt5test5 libqt5widgets5 libqt5xml5
  librhash0 librtmp1 libsasl2-2 libsasl2-modules-db libsensors-config
  libsensors5 libsm6 libssh2-1t64 libsub-override-perl libtool libuchardet0
  libuv1t64 libvulkan-dev libvulkan1 libwacom-common libwacom2
  libwayland-client0 libwayland-server0 libx11-6 libx11-data libx11-dev
  libx11-xcb1 libxau-dev libxau6 libxcb-dri2-0 libxcb-dri3-0 libxcb-glx0
  libxcb-icccm4 libxcb-image0 libxcb-keysyms1 libxcb-present0 libxcb-randr0
  libxcb-render-util0 libxcb-render0 libxcb-shape0 libxcb-shm0 libxcb-sync1
  libxcb-util1 libxcb-xfixes0 libxcb-xinerama0 libxcb-xinput0 libxcb-xkb1
  libxcb1 libxcb1-dev libxdmcp-dev libxdmcp6 libxext-dev libxext6 libxfixes3
  libxkbcommon-x11-0 libxkbcommon0 libxml2 libxrender1 libxshmfence1
  libxxf86vm1 m4 man-db media-types netbase po-debconf python3 python3-minimal
  python3.12 python3.12-minimal qt5-qmake qt5-qmake-bin qtbase5-dev
  qtbase5-dev-tools qtchooser
  sbuild-build-depends-kylin-ai-model-manager-dummy shared-mime-info ucf
  x11-common x11proto-core-dev x11proto-dev xkb-data xorg-sgml-doctools
  xtrans-dev
0 upgraded, 172 newly installed, 1 to remove and 0 not upgraded.
Need to get 96.4 MB of archives.
After this operation, 468 MB of additional disk space will be used.
Get:1 copy:/<<BUILDDIR>>/resolver-NE9d67/apt_archive ./ sbuild-build-depends-kylin-ai-model-manager-dummy 0.invalid.0 [896 B]
Get:2 http://archive.build.openkylin.top/openkylin nile/main arm64 libgdbm6t64 arm64 1.23-ok5 [30.1 kB]
Get:3 http://archive.build.openkylin.top/openkylin nile/main arm64 libpython3.12-minimal arm64 3.12.2-ok4.1 [792 kB]
Get:4 http://archive.build.openkylin.top/openkylin nile/main arm64 libexpat1 arm64 2.6.0-ok1 [70.4 kB]
Get:5 http://archive.build.openkylin.top/openkylin nile/main arm64 python3.12-minimal arm64 3.12.2-ok4.1 [1970 kB]
Get:6 http://archive.build.openkylin.top/openkylin nile/main arm64 python3-minimal arm64 3.12.2-ok1 [23.2 kB]
Get:7 http://archive.build.openkylin.top/openkylin nile/main arm64 media-types all 10.1.0-ok1 [20.0 kB]
Get:8 http://archive.build.openkylin.top/openkylin nile/main arm64 netbase all 6.4-ok1 [10.6 kB]
Get:9 http://archive.build.openkylin.top/openkylin nile/main arm64 libpython3.12-stdlib arm64 3.12.2-ok4.1 [1865 kB]
Get:10 http://archive.build.openkylin.top/openkylin nile/main arm64 python3.12 arm64 3.12.2-ok4.1 [644 kB]
Get:11 http://archive.build.openkylin.top/openkylin nile/main arm64 libpython3-stdlib arm64 3.12.2-ok1 [6252 B]
Get:12 http://archive.build.openkylin.top/openkylin nile/main arm64 python3 arm64 3.12.2-ok1 [22.8 kB]
Get:13 http://archive.build.openkylin.top/openkylin nile/main arm64 libuchardet0 arm64 0.0.8-ok1 [65.2 kB]
Get:14 http://archive.build.openkylin.top/openkylin nile/main arm64 groff-base arm64 1.23.0-3ok1 [944 kB]
Get:15 http://archive.build.openkylin.top/openkylin nile/main arm64 bsdextrautils arm64 2.39.3-ok2build5 [64.8 kB]
Get:16 http://archive.build.openkylin.top/openkylin nile/main arm64 libpipeline1 arm64 1.5.7-ok1 [20.5 kB]
Get:17 http://archive.build.openkylin.top/openkylin nile/main arm64 man-db arm64 2.12.0-ok1 [1298 kB]
Get:18 http://archive.build.openkylin.top/openkylin nile/main arm64 libmagic-mgc arm64 1:5.45-ok1 [292 kB]
Get:19 http://archive.build.openkylin.top/openkylin nile/main arm64 libmagic1t64 arm64 1:5.45-ok1 [76.0 kB]
Get:20 http://archive.build.openkylin.top/openkylin nile/main arm64 file arm64 1:5.45-ok1 [20.6 kB]
Get:21 http://archive.build.openkylin.top/openkylin nile/main arm64 gettext-base arm64 0.22-ok3 [78.4 kB]
Get:22 http://archive.build.openkylin.top/openkylin nile/main arm64 libsasl2-modules-db arm64 2.1.28+dfsg1-ok1 [16.8 kB]
Get:23 http://archive.build.openkylin.top/openkylin nile/main arm64 libsasl2-2 arm64 2.1.28+dfsg1-ok1 [48.6 kB]
Get:24 http://archive.build.openkylin.top/openkylin nile/main arm64 ucf all 3.0043+nmu1-ok1 [53.5 kB]
Get:25 http://archive.build.openkylin.top/openkylin nile/main arm64 m4 arm64 1.4.19-ok1 [252 kB]
Get:26 http://archive.build.openkylin.top/openkylin nile/main arm64 autoconf all 2.71-ok3 [385 kB]
Get:27 http://archive.build.openkylin.top/openkylin nile/main arm64 autotools-dev all 20220506-ok1 [41.6 kB]
Get:28 http://archive.build.openkylin.top/openkylin nile/main arm64 automake all 1:1.16.5-ok1 [557 kB]
Get:29 http://archive.build.openkylin.top/openkylin nile/main arm64 autopoint all 0.22-ok3 [424 kB]
Get:30 http://archive.build.openkylin.top/openkylin nile/main arm64 libicu70 arm64 70.1-ok2 [10.3 MB]
Get:31 http://archive.build.openkylin.top/openkylin nile/main arm64 libxml2 arm64 2.9.14+dfsg-ok2 [621 kB]
Get:32 http://archive.build.openkylin.top/openkylin nile/main arm64 libarchive13t64 arm64 3.7.2-ok1 [325 kB]
Get:33 http://archive.build.openkylin.top/openkylin nile/main arm64 libbrotli1 arm64 1.1.0-ok1 [284 kB]
Get:34 http://archive.build.openkylin.top/openkylin nile/main arm64 libldap2 arm64 2.6.7+dfsg-ok1 [159 kB]
Get:35 http://archive.build.openkylin.top/openkylin nile/main arm64 libnghttp2-14 arm64 1.59.0-ok2 [67.8 kB]
Get:36 http://archive.build.openkylin.top/openkylin nile/main arm64 libpsl5t64 arm64 0.21.2-ok1.2 [53.7 kB]
Get:37 http://archive.build.openkylin.top/openkylin nile/main arm64 librtmp1 arm64 2.4+20151223.gitfa8646d.1-ok1 [58.5 kB]
Get:38 http://archive.build.openkylin.top/openkylin nile/main arm64 libssh2-1t64 arm64 1.11.0-ok1 [104 kB]
Get:39 http://archive.build.openkylin.top/openkylin nile/main arm64 libcurl4 arm64 8.5.0-ok1.9 [288 kB]
Get:40 http://archive.build.openkylin.top/openkylin nile/main arm64 libjsoncpp25 arm64 1.9.5-ok2 [66.9 kB]
Get:41 http://archive.build.openkylin.top/openkylin nile/main arm64 librhash0 arm64 1.4.3-ok2 [132 kB]
Get:42 http://archive.build.openkylin.top/openkylin nile/main arm64 libuv1t64 arm64 1.48.0-ok2 [82.2 kB]
Get:43 http://archive.build.openkylin.top/openkylin nile/main arm64 cmake-data all 3.28.3-ok4 [2124 kB]
Get:44 http://archive.build.openkylin.top/openkylin nile/main arm64 cmake arm64 3.28.3-ok4 [8124 kB]
Get:45 http://archive.build.openkylin.top/openkylin nile/main arm64 libdebhelper-perl all 13.15.3-ok1 [66.0 kB]
Get:46 http://archive.build.openkylin.top/openkylin nile/main arm64 libtool all 2.4.7-ok2 [164 kB]
Get:47 http://archive.build.openkylin.top/openkylin nile/main arm64 dh-autoreconf all 20-ok1 [16.3 kB]
Get:48 http://archive.build.openkylin.top/openkylin nile/main arm64 libarchive-zip-perl all 1.68-ok1 [90.7 kB]
Get:49 http://archive.build.openkylin.top/openkylin nile/main arm64 libsub-override-perl all 0.10-ok1 [9172 B]
Get:50 http://archive.build.openkylin.top/openkylin nile/main arm64 libfile-stripnondeterminism-perl all 1.13.1-ok1 [16.3 kB]
Get:51 http://archive.build.openkylin.top/openkylin nile/main arm64 dh-strip-nondeterminism all 1.13.1-ok1 [5324 B]
Get:52 http://archive.build.openkylin.top/openkylin nile/main arm64 libelf1t64 arm64 0.190-ok3 [163 kB]
Get:53 http://archive.build.openkylin.top/openkylin nile/main arm64 dwz arm64 0.15-1ok1 [106 kB]
Get:54 http://archive.build.openkylin.top/openkylin nile/main arm64 gettext arm64 0.22-ok3 [1178 kB]
Get:55 http://archive.build.openkylin.top/openkylin nile/main arm64 intltool-debian all 0.35.0+20060710.5-ok2 [23.2 kB]
Get:56 http://archive.build.openkylin.top/openkylin nile/main arm64 po-debconf all 1.0.21+nmu1-ok1 [227 kB]
Get:57 http://archive.build.openkylin.top/openkylin nile/main arm64 debhelper all 13.15.3-ok1 [959 kB]
Get:58 http://archive.build.openkylin.top/openkylin nile/main arm64 libfreetype6 arm64 2.13.2+dfsg-ok1 [336 kB]
Get:59 http://archive.build.openkylin.top/openkylin nile/main arm64 fonts-dejavu-core all 2.37-ok1 [1040 kB]
Get:60 http://archive.build.openkylin.top/openkylin nile/main arm64 fontconfig-config all 2.15.0-ok5 [31.7 kB]
Get:61 http://archive.build.openkylin.top/openkylin nile/main arm64 libfontconfig1 arm64 2.15.0-ok5 [123 kB]
Get:62 http://archive.build.openkylin.top/openkylin nile/main arm64 fontconfig arm64 2.15.0-ok5 [181 kB]
Get:63 http://archive.build.openkylin.top/openkylin nile/main arm64 libavahi-common-data arm64 0.8-ok1 [106 kB]
Get:64 http://archive.build.openkylin.top/openkylin nile/main arm64 libavahi-common3 arm64 0.8-ok1 [21.0 kB]
Get:65 http://archive.build.openkylin.top/openkylin nile/main arm64 libdbus-1-3 arm64 1.14.10-ok3 [185 kB]
Get:66 http://archive.build.openkylin.top/openkylin nile/main arm64 libavahi-client3 arm64 0.8-ok1 [24.2 kB]
Get:67 http://archive.build.openkylin.top/openkylin nile/main arm64 libcups2t64 arm64 2.4.7-ok2 [225 kB]
Get:68 http://archive.build.openkylin.top/openkylin nile/main arm64 libdouble-conversion3 arm64 3.3.0-ok1 [32.4 kB]
Get:69 http://archive.build.openkylin.top/openkylin nile/main arm64 libdrm-common all 2.4.120-ok1 [5588 B]
Get:70 http://archive.build.openkylin.top/openkylin nile/main arm64 libdrm2 arm64 2.4.120-ok1 [35.5 kB]
Get:71 http://archive.build.openkylin.top/openkylin nile/main arm64 libdrm-amdgpu1 arm64 2.4.120-ok1 [18.1 kB]
Get:72 http://archive.build.openkylin.top/openkylin nile/main arm64 libdrm-nouveau2 arm64 2.4.120-ok1 [16.1 kB]
Get:73 http://archive.build.openkylin.top/openkylin nile/main arm64 libdrm-radeon1 arm64 2.4.120-ok1 [18.7 kB]
Get:74 http://archive.build.openkylin.top/openkylin nile/main arm64 libedit2 arm64 3.1-20230828-ok1 [94.7 kB]
Get:75 http://archive.build.openkylin.top/openkylin nile/main arm64 libglvnd0 arm64 1.7.0-ok1 [39.4 kB]
Get:76 http://archive.build.openkylin.top/openkylin nile/main arm64 libwayland-server0 arm64 1.23.0-1ok3 [30.6 kB]
Get:77 http://archive.build.openkylin.top/openkylin nile/main arm64 libxau6 arm64 1:1.0.9-ok1 [6592 B]
Get:78 http://archive.build.openkylin.top/openkylin nile/main arm64 libxdmcp6 arm64 1:1.1.3-ok1 [9768 B]
Get:79 http://archive.build.openkylin.top/openkylin nile/main arm64 libxcb1 arm64 1.15-ok2 [42.4 kB]
Get:80 http://archive.build.openkylin.top/openkylin nile/main arm64 libxcb-randr0 arm64 1.15-ok2 [16.7 kB]
Get:81 http://archive.build.openkylin.top/openkylin nile/main arm64 libgbm1 arm64 24.0.5-ok1 [28.6 kB]
Get:82 http://archive.build.openkylin.top/openkylin nile/main arm64 libglapi-mesa arm64 24.0.5-ok1 [34.9 kB]
Get:83 http://archive.build.openkylin.top/openkylin nile/main arm64 libwayland-client0 arm64 1.23.0-1ok3 [23.1 kB]
Get:84 http://archive.build.openkylin.top/openkylin nile/main arm64 libx11-data all 2:1.8.7-ok1 [104 kB]
Get:85 http://archive.build.openkylin.top/openkylin nile/main arm64 libx11-6 arm64 2:1.8.7-ok1 [543 kB]
Get:86 http://archive.build.openkylin.top/openkylin nile/main arm64 libx11-xcb1 arm64 2:1.8.7-ok1 [7716 B]
Get:87 http://archive.build.openkylin.top/openkylin nile/main arm64 libxcb-dri2-0 arm64 1.15-ok2 [7004 B]
Get:88 http://archive.build.openkylin.top/openkylin nile/main arm64 libxcb-dri3-0 arm64 1.15-ok2 [6824 B]
Get:89 http://archive.build.openkylin.top/openkylin nile/main arm64 libxcb-present0 arm64 1.15-ok2 [5616 B]
Get:90 http://archive.build.openkylin.top/openkylin nile/main arm64 libxcb-sync1 arm64 1.15-ok2 [8976 B]
Get:91 http://archive.build.openkylin.top/openkylin nile/main arm64 libxcb-xfixes0 arm64 1.15-ok2 [9636 B]
Get:92 http://archive.build.openkylin.top/openkylin nile/main arm64 libxshmfence1 arm64 1.3-ok1 [4394 B]
Get:93 http://archive.build.openkylin.top/openkylin nile/main arm64 libegl-mesa0 arm64 24.0.5-ok1 [99.5 kB]
Get:94 http://archive.build.openkylin.top/openkylin nile/main arm64 libegl1 arm64 1.7.0-ok1 [25.5 kB]
Get:95 http://archive.build.openkylin.top/openkylin nile/main arm64 libvulkan1 arm64 1.3.275.0-ok2 [124 kB]
Get:96 http://archive.build.openkylin.top/OTHER/Internal-mirror/repack6/baseok0 nile/main arm64 libllvm17 arm64 1:17.0.6-ok0 [21.4 MB]
Get:97 http://archive.build.openkylin.top/openkylin nile/main arm64 libsensors-config all 1:3.6.0-ok1 [4392 B]
Get:98 http://archive.build.openkylin.top/openkylin nile/main arm64 libsensors5 arm64 1:3.6.0-ok1 [26.6 kB]
Get:99 http://archive.build.openkylin.top/openkylin nile/main arm64 libgl1-mesa-dri arm64 24.0.5-ok1 [6983 kB]
Get:100 http://archive.build.openkylin.top/openkylin nile/main arm64 libxcb-glx0 arm64 1.15-ok2 [22.3 kB]
Get:101 http://archive.build.openkylin.top/openkylin nile/main arm64 libxcb-shm0 arm64 1.15-ok2 [5668 B]
Get:102 http://archive.build.openkylin.top/openkylin nile/main arm64 libxext6 arm64 2:1.3.4-ok2 [29.8 kB]
Get:103 http://archive.build.openkylin.top/openkylin nile/main arm64 libxfixes3 arm64 1:6.0.0-ok1 [10.3 kB]
Get:104 http://archive.build.openkylin.top/openkylin nile/main arm64 libxxf86vm1 arm64 1:1.1.4-ok1 [9078 B]
Get:105 http://archive.build.openkylin.top/openkylin nile/main arm64 libglx-mesa0 arm64 24.0.5-ok1 [137 kB]
Get:106 http://archive.build.openkylin.top/openkylin nile/main arm64 libglx0 arm64 1.7.0-ok1 [28.3 kB]
Get:107 http://archive.build.openkylin.top/openkylin nile/main arm64 libgl1 arm64 1.7.0-ok1 [88.6 kB]
Get:108 http://archive.build.openkylin.top/openkylin nile/main arm64 xorg-sgml-doctools all 1:1.11-ok1 [9766 B]
Get:109 http://archive.build.openkylin.top/openkylin nile/main arm64 x11proto-dev all 2024.1-1ok3 [603 kB]
Get:110 http://archive.build.openkylin.top/openkylin nile/main arm64 x11proto-core-dev all 2024.1-1ok3 [2616 B]
Get:111 http://archive.build.openkylin.top/openkylin nile/main arm64 libxau-dev arm64 1:1.0.9-ok1 [10.2 kB]
Get:112 http://archive.build.openkylin.top/openkylin nile/main arm64 libxdmcp-dev arm64 1:1.1.3-ok1 [26.2 kB]
Get:113 http://archive.build.openkylin.top/openkylin nile/main arm64 xtrans-dev all 1.4.0-ok1 [68.5 kB]
Get:114 http://archive.build.openkylin.top/openkylin nile/main arm64 libpthread-stubs0-dev arm64 0.4-ok2 [4240 B]
Get:115 http://archive.build.openkylin.top/openkylin nile/main arm64 libxcb1-dev arm64 1.15-ok2 [81.2 kB]
Get:116 http://archive.build.openkylin.top/openkylin nile/main arm64 libx11-dev arm64 2:1.8.7-ok1 [637 kB]
Get:117 http://archive.build.openkylin.top/openkylin nile/main arm64 libglx-dev arm64 1.7.0-ok1 [13.9 kB]
Get:118 http://archive.build.openkylin.top/openkylin nile/main arm64 libgl-dev arm64 1.7.0-ok1 [98.8 kB]
Get:119 http://archive.build.openkylin.top/openkylin nile/main arm64 libegl-dev arm64 1.7.0-ok1 [17.7 kB]
Get:120 http://archive.build.openkylin.top/openkylin nile/main arm64 libevdev2 arm64 1.13.1+dfsg-ok1 [28.8 kB]
Get:121 http://archive.build.openkylin.top/openkylin nile/main arm64 libglib2.0-0t64 arm64 2.80.0-ok1.2~1128 [1330 kB]
Get:122 http://archive.build.openkylin.top/openkylin nile/main arm64 libopengl0 arm64 1.7.0-ok1 [29.8 kB]
Get:123 http://archive.build.openkylin.top/openkylin nile/main arm64 libglu1-mesa arm64 9.0.2-ok1 [118 kB]
Get:124 http://archive.build.openkylin.top/openkylin nile/main arm64 libopengl-dev arm64 1.7.0-ok1 [3592 B]
Get:125 http://archive.build.openkylin.top/openkylin nile/main arm64 libglu1-mesa-dev arm64 9.0.2-ok1 [192 kB]
Get:126 http://archive.build.openkylin.top/openkylin nile/main arm64 libgraphite2-3 arm64 1.3.14-ok1 [59.4 kB]
Get:127 http://archive.build.openkylin.top/openkylin nile/main arm64 libgudev-1.0-0 arm64 1:238-ok2 [12.5 kB]
Get:128 http://archive.build.openkylin.top/openkylin nile/main arm64 libharfbuzz0b arm64 8.3.0-ok2 [396 kB]
Get:129 http://archive.build.openkylin.top/openkylin nile/main arm64 x11-common all 1:7.7+23-ok1 [20.8 kB]
Get:130 http://archive.build.openkylin.top/openkylin nile/main arm64 libice6 arm64 2:1.0.10-ok1 [40.3 kB]
Get:131 http://archive.build.openkylin.top/openkylin nile/main arm64 libicu74 arm64 74.2-ok6 [9263 kB]
Get:132 http://archive.build.openkylin.top/openkylin nile/main arm64 libwacom-common all 1.3-ok3.2 [44.1 kB]
Get:133 http://archive.build.openkylin.top/openkylin nile/main arm64 libwacom2 arm64 1.3-ok3.2 [19.6 kB]
Get:134 http://archive.build.openkylin.top/openkylin nile/main arm64 libinput-bin arm64 1.25.0-ok1.2 [19.4 kB]
Get:135 http://archive.build.openkylin.top/openkylin nile/main arm64 libmtdev1t64 arm64 1.1.6-ok1 [12.8 kB]
Get:136 http://archive.build.openkylin.top/openkylin nile/main arm64 libinput10 arm64 1.25.0-ok1.2 [112 kB]
Get:137 http://archive.build.openkylin.top/openkylin nile/main arm64 libjpeg62-turbo arm64 1:2.1.2-ok2 [150 kB]
Get:138 http://archive.build.openkylin.top/openkylin nile/main arm64 libmd4c0 arm64 0.4.8-ok1 [35.6 kB]
Get:139 http://archive.build.openkylin.top/openkylin nile/main arm64 libpcre2-16-0 arm64 10.42-4ok2 [168 kB]
Get:140 http://archive.build.openkylin.top/openkylin nile-proposed/main arm64 shared-mime-info arm64 2.2-ok6.1 [738 kB]
Get:141 http://archive.build.openkylin.top/openkylin nile/main arm64 libqt5core5a arm64 5.15.10+dfsg-3ok2.13 [1662 kB]
Get:142 http://archive.build.openkylin.top/openkylin nile/main arm64 libqt5concurrent5 arm64 5.15.10+dfsg-3ok2.13 [33.8 kB]
Get:143 http://archive.build.openkylin.top/openkylin nile/main arm64 libqt5dbus5 arm64 5.15.10+dfsg-3ok2.13 [194 kB]
Get:144 http://archive.build.openkylin.top/openkylin nile/main arm64 libqt5network5 arm64 5.15.10+dfsg-3ok2.13 [639 kB]
Get:145 http://archive.build.openkylin.top/openkylin nile/main arm64 libsm6 arm64 2:1.2.3-ok1 [14.5 kB]
Get:146 http://archive.build.openkylin.top/openkylin nile/main arm64 libxcb-icccm4 arm64 0.4.1-ok1 [9804 B]
Get:147 http://archive.build.openkylin.top/openkylin nile/main arm64 libxcb-util1 arm64 0.4.0-ok2 [11.2 kB]
Get:148 http://archive.build.openkylin.top/openkylin nile/main arm64 libxcb-image0 arm64 0.4.0-ok1 [11.3 kB]
Get:149 http://archive.build.openkylin.top/openkylin nile/main arm64 libxcb-keysyms1 arm64 0.4.0-ok1 [7530 B]
Get:150 http://archive.build.openkylin.top/openkylin nile/main arm64 libxcb-render0 arm64 1.15-ok2 [14.9 kB]
Get:151 http://archive.build.openkylin.top/openkylin nile/main arm64 libxcb-render-util0 arm64 0.3.9-ok1 [9288 B]
Get:152 http://archive.build.openkylin.top/openkylin nile/main arm64 libxcb-shape0 arm64 1.15-ok2 [5928 B]
Get:153 http://archive.build.openkylin.top/openkylin nile/main arm64 libxcb-xinerama0 arm64 1.15-ok2 [5392 B]
Get:154 http://archive.build.openkylin.top/openkylin nile/main arm64 libxcb-xinput0 arm64 1.15-ok2 [30.5 kB]
Get:155 http://archive.build.openkylin.top/openkylin nile/main arm64 libxcb-xkb1 arm64 1.15-ok2 [28.9 kB]
Get:156 http://archive.build.openkylin.top/openkylin nile/main arm64 xkb-data all 2.41-ok1 [794 kB]
Get:157 http://archive.build.openkylin.top/openkylin nile/main arm64 libxkbcommon0 arm64 1.5.0-ok1 [106 kB]
Get:158 http://archive.build.openkylin.top/openkylin nile/main arm64 libxkbcommon-x11-0 arm64 1.5.0-ok1 [15.1 kB]
Get:159 http://archive.build.openkylin.top/openkylin nile/main arm64 libxrender1 arm64 1:0.9.10-ok1 [17.7 kB]
Get:160 http://archive.build.openkylin.top/openkylin nile/main arm64 libqt5gui5 arm64 5.15.10+dfsg-3ok2.13 [3068 kB]
Get:161 http://archive.build.openkylin.top/openkylin nile/main arm64 libqt5widgets5 arm64 5.15.10+dfsg-3ok2.13 [2247 kB]
Get:162 http://archive.build.openkylin.top/openkylin nile/main arm64 libqt5printsupport5 arm64 5.15.10+dfsg-3ok2.13 [186 kB]
Get:163 http://archive.build.openkylin.top/openkylin nile/main arm64 libqt5sql5 arm64 5.15.10+dfsg-3ok2.13 [110 kB]
Get:164 http://archive.build.openkylin.top/openkylin nile/main arm64 libqt5test5 arm64 5.15.10+dfsg-3ok2.13 [126 kB]
Get:165 http://archive.build.openkylin.top/openkylin nile/main arm64 libqt5xml5 arm64 5.15.10+dfsg-3ok2.13 [110 kB]
Get:166 http://archive.build.openkylin.top/openkylin nile/main arm64 libvulkan-dev arm64 1.3.275.0-ok2 [1308 kB]
Get:167 http://archive.build.openkylin.top/openkylin nile/main arm64 libxext-dev arm64 2:1.3.4-ok2 [85.6 kB]
Get:168 http://archive.build.openkylin.top/openkylin nile/main arm64 qt5-qmake-bin arm64 5.15.10+dfsg-3ok2.13 [875 kB]
Get:169 http://archive.build.openkylin.top/openkylin nile/main arm64 qtchooser arm64 66-ok2 [20.0 kB]
Get:170 http://archive.build.openkylin.top/openkylin nile/main arm64 qt5-qmake arm64 5.15.10+dfsg-3ok2.13 [205 kB]
Get:171 http://archive.build.openkylin.top/openkylin nile/main arm64 qtbase5-dev-tools arm64 5.15.10+dfsg-3ok2.13 [690 kB]
Get:172 http://archive.build.openkylin.top/openkylin nile/main arm64 qtbase5-dev arm64 5.15.10+dfsg-3ok2.13 [1093 kB]
debconf: delaying package configuration, since apt-utils is not installed
Fetched 96.4 MB in 2s (45.8 MB/s)
dpkg: libgdbm6:arm64: dependency problems, but removing anyway as you requested:
 libperl5.36:arm64 depends on libgdbm6 (>= 1.18-3).
 libperl5.30:arm64 depends on libgdbm6 (>= 1.18-0).
 libgdbm-compat4:arm64 depends on libgdbm6 (>= 1.16).

(Reading database ... 16381 files and directories currently installed.)
Removing libgdbm6:arm64 (1.18.1-ok2) ...
Selecting previously unselected package libgdbm6t64:arm64.
(Reading database ... 16376 files and directories currently installed.)
Preparing to unpack .../libgdbm6t64_1.23-ok5_arm64.deb ...
Unpacking libgdbm6t64:arm64 (1.23-ok5) ...
Selecting previously unselected package libpython3.12-minimal:arm64.
Preparing to unpack .../libpython3.12-minimal_3.12.2-ok4.1_arm64.deb ...
Unpacking libpython3.12-minimal:arm64 (3.12.2-ok4.1) ...
Selecting previously unselected package libexpat1:arm64.
Preparing to unpack .../libexpat1_2.6.0-ok1_arm64.deb ...
Unpacking libexpat1:arm64 (2.6.0-ok1) ...
Selecting previously unselected package python3.12-minimal.
Preparing to unpack .../python3.12-minimal_3.12.2-ok4.1_arm64.deb ...
Unpacking python3.12-minimal (3.12.2-ok4.1) ...
Setting up libpython3.12-minimal:arm64 (3.12.2-ok4.1) ...
Setting up libexpat1:arm64 (2.6.0-ok1) ...
Setting up python3.12-minimal (3.12.2-ok4.1) ...
Selecting previously unselected package python3-minimal.
(Reading database ... 16700 files and directories currently installed.)
Preparing to unpack .../0-python3-minimal_3.12.2-ok1_arm64.deb ...
Unpacking python3-minimal (3.12.2-ok1) ...
Selecting previously unselected package media-types.
Preparing to unpack .../1-media-types_10.1.0-ok1_all.deb ...
Unpacking media-types (10.1.0-ok1) ...
Selecting previously unselected package netbase.
Preparing to unpack .../2-netbase_6.4-ok1_all.deb ...
Unpacking netbase (6.4-ok1) ...
Selecting previously unselected package libpython3.12-stdlib:arm64.
Preparing to unpack .../3-libpython3.12-stdlib_3.12.2-ok4.1_arm64.deb ...
Unpacking libpython3.12-stdlib:arm64 (3.12.2-ok4.1) ...
Selecting previously unselected package python3.12.
Preparing to unpack .../4-python3.12_3.12.2-ok4.1_arm64.deb ...
Unpacking python3.12 (3.12.2-ok4.1) ...
Selecting previously unselected package libpython3-stdlib:arm64.
Preparing to unpack .../5-libpython3-stdlib_3.12.2-ok1_arm64.deb ...
Unpacking libpython3-stdlib:arm64 (3.12.2-ok1) ...
Setting up python3-minimal (3.12.2-ok1) ...
Selecting previously unselected package python3.
(Reading database ... 17142 files and directories currently installed.)
Preparing to unpack .../000-python3_3.12.2-ok1_arm64.deb ...
Unpacking python3 (3.12.2-ok1) ...
Selecting previously unselected package libuchardet0:arm64.
Preparing to unpack .../001-libuchardet0_0.0.8-ok1_arm64.deb ...
Unpacking libuchardet0:arm64 (0.0.8-ok1) ...
Selecting previously unselected package groff-base.
Preparing to unpack .../002-groff-base_1.23.0-3ok1_arm64.deb ...
Unpacking groff-base (1.23.0-3ok1) ...
Selecting previously unselected package bsdextrautils.
Preparing to unpack .../003-bsdextrautils_2.39.3-ok2build5_arm64.deb ...
Unpacking bsdextrautils (2.39.3-ok2build5) ...
Selecting previously unselected package libpipeline1:arm64.
Preparing to unpack .../004-libpipeline1_1.5.7-ok1_arm64.deb ...
Unpacking libpipeline1:arm64 (1.5.7-ok1) ...
Selecting previously unselected package man-db.
Preparing to unpack .../005-man-db_2.12.0-ok1_arm64.deb ...
Unpacking man-db (2.12.0-ok1) ...
Selecting previously unselected package libmagic-mgc.
Preparing to unpack .../006-libmagic-mgc_1%3a5.45-ok1_arm64.deb ...
Unpacking libmagic-mgc (1:5.45-ok1) ...
Selecting previously unselected package libmagic1t64:arm64.
Preparing to unpack .../007-libmagic1t64_1%3a5.45-ok1_arm64.deb ...
Unpacking libmagic1t64:arm64 (1:5.45-ok1) ...
Selecting previously unselected package file.
Preparing to unpack .../008-file_1%3a5.45-ok1_arm64.deb ...
Unpacking file (1:5.45-ok1) ...
Selecting previously unselected package gettext-base.
Preparing to unpack .../009-gettext-base_0.22-ok3_arm64.deb ...
Unpacking gettext-base (0.22-ok3) ...
Selecting previously unselected package libsasl2-modules-db:arm64.
Preparing to unpack .../010-libsasl2-modules-db_2.1.28+dfsg1-ok1_arm64.deb ...
Unpacking libsasl2-modules-db:arm64 (2.1.28+dfsg1-ok1) ...
Selecting previously unselected package libsasl2-2:arm64.
Preparing to unpack .../011-libsasl2-2_2.1.28+dfsg1-ok1_arm64.deb ...
Unpacking libsasl2-2:arm64 (2.1.28+dfsg1-ok1) ...
Selecting previously unselected package ucf.
Preparing to unpack .../012-ucf_3.0043+nmu1-ok1_all.deb ...
Moving old data out of the way
Unpacking ucf (3.0043+nmu1-ok1) ...
Selecting previously unselected package m4.
Preparing to unpack .../013-m4_1.4.19-ok1_arm64.deb ...
Unpacking m4 (1.4.19-ok1) ...
Selecting previously unselected package autoconf.
Preparing to unpack .../014-autoconf_2.71-ok3_all.deb ...
Unpacking autoconf (2.71-ok3) ...
Selecting previously unselected package autotools-dev.
Preparing to unpack .../015-autotools-dev_20220506-ok1_all.deb ...
Unpacking autotools-dev (20220506-ok1) ...
Selecting previously unselected package automake.
Preparing to unpack .../016-automake_1%3a1.16.5-ok1_all.deb ...
Unpacking automake (1:1.16.5-ok1) ...
Selecting previously unselected package autopoint.
Preparing to unpack .../017-autopoint_0.22-ok3_all.deb ...
Unpacking autopoint (0.22-ok3) ...
Selecting previously unselected package libicu70:arm64.
Preparing to unpack .../018-libicu70_70.1-ok2_arm64.deb ...
Unpacking libicu70:arm64 (70.1-ok2) ...
Selecting previously unselected package libxml2:arm64.
Preparing to unpack .../019-libxml2_2.9.14+dfsg-ok2_arm64.deb ...
Unpacking libxml2:arm64 (2.9.14+dfsg-ok2) ...
Selecting previously unselected package libarchive13t64:arm64.
Preparing to unpack .../020-libarchive13t64_3.7.2-ok1_arm64.deb ...
Unpacking libarchive13t64:arm64 (3.7.2-ok1) ...
Selecting previously unselected package libbrotli1:arm64.
Preparing to unpack .../021-libbrotli1_1.1.0-ok1_arm64.deb ...
Unpacking libbrotli1:arm64 (1.1.0-ok1) ...
Selecting previously unselected package libldap2:arm64.
Preparing to unpack .../022-libldap2_2.6.7+dfsg-ok1_arm64.deb ...
Unpacking libldap2:arm64 (2.6.7+dfsg-ok1) ...
Selecting previously unselected package libnghttp2-14:arm64.
Preparing to unpack .../023-libnghttp2-14_1.59.0-ok2_arm64.deb ...
Unpacking libnghttp2-14:arm64 (1.59.0-ok2) ...
Selecting previously unselected package libpsl5t64:arm64.
Preparing to unpack .../024-libpsl5t64_0.21.2-ok1.2_arm64.deb ...
Unpacking libpsl5t64:arm64 (0.21.2-ok1.2) ...
Selecting previously unselected package librtmp1:arm64.
Preparing to unpack .../025-librtmp1_2.4+20151223.gitfa8646d.1-ok1_arm64.deb ...
Unpacking librtmp1:arm64 (2.4+20151223.gitfa8646d.1-ok1) ...
Selecting previously unselected package libssh2-1t64:arm64.
Preparing to unpack .../026-libssh2-1t64_1.11.0-ok1_arm64.deb ...
Unpacking libssh2-1t64:arm64 (1.11.0-ok1) ...
Selecting previously unselected package libcurl4:arm64.
Preparing to unpack .../027-libcurl4_8.5.0-ok1.9_arm64.deb ...
Unpacking libcurl4:arm64 (8.5.0-ok1.9) ...
Selecting previously unselected package libjsoncpp25:arm64.
Preparing to unpack .../028-libjsoncpp25_1.9.5-ok2_arm64.deb ...
Unpacking libjsoncpp25:arm64 (1.9.5-ok2) ...
Selecting previously unselected package librhash0:arm64.
Preparing to unpack .../029-librhash0_1.4.3-ok2_arm64.deb ...
Unpacking librhash0:arm64 (1.4.3-ok2) ...
Selecting previously unselected package libuv1t64:arm64.
Preparing to unpack .../030-libuv1t64_1.48.0-ok2_arm64.deb ...
Unpacking libuv1t64:arm64 (1.48.0-ok2) ...
Selecting previously unselected package cmake-data.
Preparing to unpack .../031-cmake-data_3.28.3-ok4_all.deb ...
Unpacking cmake-data (3.28.3-ok4) ...
Selecting previously unselected package cmake.
Preparing to unpack .../032-cmake_3.28.3-ok4_arm64.deb ...
Unpacking cmake (3.28.3-ok4) ...
Selecting previously unselected package libdebhelper-perl.
Preparing to unpack .../033-libdebhelper-perl_13.15.3-ok1_all.deb ...
Unpacking libdebhelper-perl (13.15.3-ok1) ...
Selecting previously unselected package libtool.
Preparing to unpack .../034-libtool_2.4.7-ok2_all.deb ...
Unpacking libtool (2.4.7-ok2) ...
Selecting previously unselected package dh-autoreconf.
Preparing to unpack .../035-dh-autoreconf_20-ok1_all.deb ...
Unpacking dh-autoreconf (20-ok1) ...
Selecting previously unselected package libarchive-zip-perl.
Preparing to unpack .../036-libarchive-zip-perl_1.68-ok1_all.deb ...
Unpacking libarchive-zip-perl (1.68-ok1) ...
Selecting previously unselected package libsub-override-perl.
Preparing to unpack .../037-libsub-override-perl_0.10-ok1_all.deb ...
Unpacking libsub-override-perl (0.10-ok1) ...
Selecting previously unselected package libfile-stripnondeterminism-perl.
Preparing to unpack .../038-libfile-stripnondeterminism-perl_1.13.1-ok1_all.deb ...
Unpacking libfile-stripnondeterminism-perl (1.13.1-ok1) ...
Selecting previously unselected package dh-strip-nondeterminism.
Preparing to unpack .../039-dh-strip-nondeterminism_1.13.1-ok1_all.deb ...
Unpacking dh-strip-nondeterminism (1.13.1-ok1) ...
Selecting previously unselected package libelf1t64:arm64.
Preparing to unpack .../040-libelf1t64_0.190-ok3_arm64.deb ...
Unpacking libelf1t64:arm64 (0.190-ok3) ...
Selecting previously unselected package dwz.
Preparing to unpack .../041-dwz_0.15-1ok1_arm64.deb ...
Unpacking dwz (0.15-1ok1) ...
Selecting previously unselected package gettext.
Preparing to unpack .../042-gettext_0.22-ok3_arm64.deb ...
Unpacking gettext (0.22-ok3) ...
Selecting previously unselected package intltool-debian.
Preparing to unpack .../043-intltool-debian_0.35.0+20060710.5-ok2_all.deb ...
Unpacking intltool-debian (0.35.0+20060710.5-ok2) ...
Selecting previously unselected package po-debconf.
Preparing to unpack .../044-po-debconf_1.0.21+nmu1-ok1_all.deb ...
Unpacking po-debconf (1.0.21+nmu1-ok1) ...
Selecting previously unselected package debhelper.
Preparing to unpack .../045-debhelper_13.15.3-ok1_all.deb ...
Unpacking debhelper (13.15.3-ok1) ...
Selecting previously unselected package libfreetype6:arm64.
Preparing to unpack .../046-libfreetype6_2.13.2+dfsg-ok1_arm64.deb ...
Unpacking libfreetype6:arm64 (2.13.2+dfsg-ok1) ...
Selecting previously unselected package fonts-dejavu-core.
Preparing to unpack .../047-fonts-dejavu-core_2.37-ok1_all.deb ...
Unpacking fonts-dejavu-core (2.37-ok1) ...
Selecting previously unselected package fontconfig-config.
Preparing to unpack .../048-fontconfig-config_2.15.0-ok5_all.deb ...
Unpacking fontconfig-config (2.15.0-ok5) ...
Selecting previously unselected package libfontconfig1:arm64.
Preparing to unpack .../049-libfontconfig1_2.15.0-ok5_arm64.deb ...
Unpacking libfontconfig1:arm64 (2.15.0-ok5) ...
Selecting previously unselected package fontconfig.
Preparing to unpack .../050-fontconfig_2.15.0-ok5_arm64.deb ...
Unpacking fontconfig (2.15.0-ok5) ...
Selecting previously unselected package libavahi-common-data:arm64.
Preparing to unpack .../051-libavahi-common-data_0.8-ok1_arm64.deb ...
Unpacking libavahi-common-data:arm64 (0.8-ok1) ...
Selecting previously unselected package libavahi-common3:arm64.
Preparing to unpack .../052-libavahi-common3_0.8-ok1_arm64.deb ...
Unpacking libavahi-common3:arm64 (0.8-ok1) ...
Selecting previously unselected package libdbus-1-3:arm64.
Preparing to unpack .../053-libdbus-1-3_1.14.10-ok3_arm64.deb ...
Unpacking libdbus-1-3:arm64 (1.14.10-ok3) ...
Selecting previously unselected package libavahi-client3:arm64.
Preparing to unpack .../054-libavahi-client3_0.8-ok1_arm64.deb ...
Unpacking libavahi-client3:arm64 (0.8-ok1) ...
Selecting previously unselected package libcups2t64:arm64.
Preparing to unpack .../055-libcups2t64_2.4.7-ok2_arm64.deb ...
Unpacking libcups2t64:arm64 (2.4.7-ok2) ...
Selecting previously unselected package libdouble-conversion3:arm64.
Preparing to unpack .../056-libdouble-conversion3_3.3.0-ok1_arm64.deb ...
Unpacking libdouble-conversion3:arm64 (3.3.0-ok1) ...
Selecting previously unselected package libdrm-common.
Preparing to unpack .../057-libdrm-common_2.4.120-ok1_all.deb ...
Unpacking libdrm-common (2.4.120-ok1) ...
Selecting previously unselected package libdrm2:arm64.
Preparing to unpack .../058-libdrm2_2.4.120-ok1_arm64.deb ...
Unpacking libdrm2:arm64 (2.4.120-ok1) ...
Selecting previously unselected package libdrm-amdgpu1:arm64.
Preparing to unpack .../059-libdrm-amdgpu1_2.4.120-ok1_arm64.deb ...
Unpacking libdrm-amdgpu1:arm64 (2.4.120-ok1) ...
Selecting previously unselected package libdrm-nouveau2:arm64.
Preparing to unpack .../060-libdrm-nouveau2_2.4.120-ok1_arm64.deb ...
Unpacking libdrm-nouveau2:arm64 (2.4.120-ok1) ...
Selecting previously unselected package libdrm-radeon1:arm64.
Preparing to unpack .../061-libdrm-radeon1_2.4.120-ok1_arm64.deb ...
Unpacking libdrm-radeon1:arm64 (2.4.120-ok1) ...
Selecting previously unselected package libedit2:arm64.
Preparing to unpack .../062-libedit2_3.1-20230828-ok1_arm64.deb ...
Unpacking libedit2:arm64 (3.1-20230828-ok1) ...
Selecting previously unselected package libglvnd0:arm64.
Preparing to unpack .../063-libglvnd0_1.7.0-ok1_arm64.deb ...
Unpacking libglvnd0:arm64 (1.7.0-ok1) ...
Selecting previously unselected package libwayland-server0:arm64.
Preparing to unpack .../064-libwayland-server0_1.23.0-1ok3_arm64.deb ...
Unpacking libwayland-server0:arm64 (1.23.0-1ok3) ...
Selecting previously unselected package libxau6:arm64.
Preparing to unpack .../065-libxau6_1%3a1.0.9-ok1_arm64.deb ...
Unpacking libxau6:arm64 (1:1.0.9-ok1) ...
Selecting previously unselected package libxdmcp6:arm64.
Preparing to unpack .../066-libxdmcp6_1%3a1.1.3-ok1_arm64.deb ...
Unpacking libxdmcp6:arm64 (1:1.1.3-ok1) ...
Selecting previously unselected package libxcb1:arm64.
Preparing to unpack .../067-libxcb1_1.15-ok2_arm64.deb ...
Unpacking libxcb1:arm64 (1.15-ok2) ...
Selecting previously unselected package libxcb-randr0:arm64.
Preparing to unpack .../068-libxcb-randr0_1.15-ok2_arm64.deb ...
Unpacking libxcb-randr0:arm64 (1.15-ok2) ...
Selecting previously unselected package libgbm1:arm64.
Preparing to unpack .../069-libgbm1_24.0.5-ok1_arm64.deb ...
Unpacking libgbm1:arm64 (24.0.5-ok1) ...
Selecting previously unselected package libglapi-mesa:arm64.
Preparing to unpack .../070-libglapi-mesa_24.0.5-ok1_arm64.deb ...
Unpacking libglapi-mesa:arm64 (24.0.5-ok1) ...
Selecting previously unselected package libwayland-client0:arm64.
Preparing to unpack .../071-libwayland-client0_1.23.0-1ok3_arm64.deb ...
Unpacking libwayland-client0:arm64 (1.23.0-1ok3) ...
Selecting previously unselected package libx11-data.
Preparing to unpack .../072-libx11-data_2%3a1.8.7-ok1_all.deb ...
Unpacking libx11-data (2:1.8.7-ok1) ...
Selecting previously unselected package libx11-6:arm64.
Preparing to unpack .../073-libx11-6_2%3a1.8.7-ok1_arm64.deb ...
Unpacking libx11-6:arm64 (2:1.8.7-ok1) ...
Selecting previously unselected package libx11-xcb1:arm64.
Preparing to unpack .../074-libx11-xcb1_2%3a1.8.7-ok1_arm64.deb ...
Unpacking libx11-xcb1:arm64 (2:1.8.7-ok1) ...
Selecting previously unselected package libxcb-dri2-0:arm64.
Preparing to unpack .../075-libxcb-dri2-0_1.15-ok2_arm64.deb ...
Unpacking libxcb-dri2-0:arm64 (1.15-ok2) ...
Selecting previously unselected package libxcb-dri3-0:arm64.
Preparing to unpack .../076-libxcb-dri3-0_1.15-ok2_arm64.deb ...
Unpacking libxcb-dri3-0:arm64 (1.15-ok2) ...
Selecting previously unselected package libxcb-present0:arm64.
Preparing to unpack .../077-libxcb-present0_1.15-ok2_arm64.deb ...
Unpacking libxcb-present0:arm64 (1.15-ok2) ...
Selecting previously unselected package libxcb-sync1:arm64.
Preparing to unpack .../078-libxcb-sync1_1.15-ok2_arm64.deb ...
Unpacking libxcb-sync1:arm64 (1.15-ok2) ...
Selecting previously unselected package libxcb-xfixes0:arm64.
Preparing to unpack .../079-libxcb-xfixes0_1.15-ok2_arm64.deb ...
Unpacking libxcb-xfixes0:arm64 (1.15-ok2) ...
Selecting previously unselected package libxshmfence1:arm64.
Preparing to unpack .../080-libxshmfence1_1.3-ok1_arm64.deb ...
Unpacking libxshmfence1:arm64 (1.3-ok1) ...
Selecting previously unselected package libegl-mesa0:arm64.
Preparing to unpack .../081-libegl-mesa0_24.0.5-ok1_arm64.deb ...
Unpacking libegl-mesa0:arm64 (24.0.5-ok1) ...
Selecting previously unselected package libegl1:arm64.
Preparing to unpack .../082-libegl1_1.7.0-ok1_arm64.deb ...
Unpacking libegl1:arm64 (1.7.0-ok1) ...
Selecting previously unselected package libvulkan1:arm64.
Preparing to unpack .../083-libvulkan1_1.3.275.0-ok2_arm64.deb ...
Unpacking libvulkan1:arm64 (1.3.275.0-ok2) ...
Selecting previously unselected package libllvm17:arm64.
Preparing to unpack .../084-libllvm17_1%3a17.0.6-ok0_arm64.deb ...
Unpacking libllvm17:arm64 (1:17.0.6-ok0) ...
Selecting previously unselected package libsensors-config.
Preparing to unpack .../085-libsensors-config_1%3a3.6.0-ok1_all.deb ...
Unpacking libsensors-config (1:3.6.0-ok1) ...
Selecting previously unselected package libsensors5:arm64.
Preparing to unpack .../086-libsensors5_1%3a3.6.0-ok1_arm64.deb ...
Unpacking libsensors5:arm64 (1:3.6.0-ok1) ...
Selecting previously unselected package libgl1-mesa-dri:arm64.
Preparing to unpack .../087-libgl1-mesa-dri_24.0.5-ok1_arm64.deb ...
Unpacking libgl1-mesa-dri:arm64 (24.0.5-ok1) ...
Selecting previously unselected package libxcb-glx0:arm64.
Preparing to unpack .../088-libxcb-glx0_1.15-ok2_arm64.deb ...
Unpacking libxcb-glx0:arm64 (1.15-ok2) ...
Selecting previously unselected package libxcb-shm0:arm64.
Preparing to unpack .../089-libxcb-shm0_1.15-ok2_arm64.deb ...
Unpacking libxcb-shm0:arm64 (1.15-ok2) ...
Selecting previously unselected package libxext6:arm64.
Preparing to unpack .../090-libxext6_2%3a1.3.4-ok2_arm64.deb ...
Unpacking libxext6:arm64 (2:1.3.4-ok2) ...
Selecting previously unselected package libxfixes3:arm64.
Preparing to unpack .../091-libxfixes3_1%3a6.0.0-ok1_arm64.deb ...
Unpacking libxfixes3:arm64 (1:6.0.0-ok1) ...
Selecting previously unselected package libxxf86vm1:arm64.
Preparing to unpack .../092-libxxf86vm1_1%3a1.1.4-ok1_arm64.deb ...
Unpacking libxxf86vm1:arm64 (1:1.1.4-ok1) ...
Selecting previously unselected package libglx-mesa0:arm64.
Preparing to unpack .../093-libglx-mesa0_24.0.5-ok1_arm64.deb ...
Unpacking libglx-mesa0:arm64 (24.0.5-ok1) ...
Selecting previously unselected package libglx0:arm64.
Preparing to unpack .../094-libglx0_1.7.0-ok1_arm64.deb ...
Unpacking libglx0:arm64 (1.7.0-ok1) ...
Selecting previously unselected package libgl1:arm64.
Preparing to unpack .../095-libgl1_1.7.0-ok1_arm64.deb ...
Unpacking libgl1:arm64 (1.7.0-ok1) ...
Selecting previously unselected package xorg-sgml-doctools.
Preparing to unpack .../096-xorg-sgml-doctools_1%3a1.11-ok1_all.deb ...
Unpacking xorg-sgml-doctools (1:1.11-ok1) ...
Selecting previously unselected package x11proto-dev.
Preparing to unpack .../097-x11proto-dev_2024.1-1ok3_all.deb ...
Unpacking x11proto-dev (2024.1-1ok3) ...
Selecting previously unselected package x11proto-core-dev.
Preparing to unpack .../098-x11proto-core-dev_2024.1-1ok3_all.deb ...
Unpacking x11proto-core-dev (2024.1-1ok3) ...
Selecting previously unselected package libxau-dev:arm64.
Preparing to unpack .../099-libxau-dev_1%3a1.0.9-ok1_arm64.deb ...
Unpacking libxau-dev:arm64 (1:1.0.9-ok1) ...
Selecting previously unselected package libxdmcp-dev:arm64.
Preparing to unpack .../100-libxdmcp-dev_1%3a1.1.3-ok1_arm64.deb ...
Unpacking libxdmcp-dev:arm64 (1:1.1.3-ok1) ...
Selecting previously unselected package xtrans-dev.
Preparing to unpack .../101-xtrans-dev_1.4.0-ok1_all.deb ...
Unpacking xtrans-dev (1.4.0-ok1) ...
Selecting previously unselected package libpthread-stubs0-dev:arm64.
Preparing to unpack .../102-libpthread-stubs0-dev_0.4-ok2_arm64.deb ...
Unpacking libpthread-stubs0-dev:arm64 (0.4-ok2) ...
Selecting previously unselected package libxcb1-dev:arm64.
Preparing to unpack .../103-libxcb1-dev_1.15-ok2_arm64.deb ...
Unpacking libxcb1-dev:arm64 (1.15-ok2) ...
Selecting previously unselected package libx11-dev:arm64.
Preparing to unpack .../104-libx11-dev_2%3a1.8.7-ok1_arm64.deb ...
Unpacking libx11-dev:arm64 (2:1.8.7-ok1) ...
Selecting previously unselected package libglx-dev:arm64.
Preparing to unpack .../105-libglx-dev_1.7.0-ok1_arm64.deb ...
Unpacking libglx-dev:arm64 (1.7.0-ok1) ...
Selecting previously unselected package libgl-dev:arm64.
Preparing to unpack .../106-libgl-dev_1.7.0-ok1_arm64.deb ...
Unpacking libgl-dev:arm64 (1.7.0-ok1) ...
Selecting previously unselected package libegl-dev:arm64.
Preparing to unpack .../107-libegl-dev_1.7.0-ok1_arm64.deb ...
Unpacking libegl-dev:arm64 (1.7.0-ok1) ...
Selecting previously unselected package libevdev2:arm64.
Preparing to unpack .../108-libevdev2_1.13.1+dfsg-ok1_arm64.deb ...
Unpacking libevdev2:arm64 (1.13.1+dfsg-ok1) ...
Selecting previously unselected package libglib2.0-0t64:arm64.
Preparing to unpack .../109-libglib2.0-0t64_2.80.0-ok1.2~1128_arm64.deb ...
Unpacking libglib2.0-0t64:arm64 (2.80.0-ok1.2~1128) ...
Selecting previously unselected package libopengl0:arm64.
Preparing to unpack .../110-libopengl0_1.7.0-ok1_arm64.deb ...
Unpacking libopengl0:arm64 (1.7.0-ok1) ...
Selecting previously unselected package libglu1-mesa:arm64.
Preparing to unpack .../111-libglu1-mesa_9.0.2-ok1_arm64.deb ...
Unpacking libglu1-mesa:arm64 (9.0.2-ok1) ...
Selecting previously unselected package libopengl-dev:arm64.
Preparing to unpack .../112-libopengl-dev_1.7.0-ok1_arm64.deb ...
Unpacking libopengl-dev:arm64 (1.7.0-ok1) ...
Selecting previously unselected package libglu1-mesa-dev:arm64.
Preparing to unpack .../113-libglu1-mesa-dev_9.0.2-ok1_arm64.deb ...
Unpacking libglu1-mesa-dev:arm64 (9.0.2-ok1) ...
Selecting previously unselected package libgraphite2-3:arm64.
Preparing to unpack .../114-libgraphite2-3_1.3.14-ok1_arm64.deb ...
Unpacking libgraphite2-3:arm64 (1.3.14-ok1) ...
Selecting previously unselected package libgudev-1.0-0:arm64.
Preparing to unpack .../115-libgudev-1.0-0_1%3a238-ok2_arm64.deb ...
Unpacking libgudev-1.0-0:arm64 (1:238-ok2) ...
Selecting previously unselected package libharfbuzz0b:arm64.
Preparing to unpack .../116-libharfbuzz0b_8.3.0-ok2_arm64.deb ...
Unpacking libharfbuzz0b:arm64 (8.3.0-ok2) ...
Selecting previously unselected package x11-common.
Preparing to unpack .../117-x11-common_1%3a7.7+23-ok1_all.deb ...
Unpacking x11-common (1:7.7+23-ok1) ...
Selecting previously unselected package libice6:arm64.
Preparing to unpack .../118-libice6_2%3a1.0.10-ok1_arm64.deb ...
Unpacking libice6:arm64 (2:1.0.10-ok1) ...
Selecting previously unselected package libicu74:arm64.
Preparing to unpack .../119-libicu74_74.2-ok6_arm64.deb ...
Unpacking libicu74:arm64 (74.2-ok6) ...
Selecting previously unselected package libwacom-common.
Preparing to unpack .../120-libwacom-common_1.3-ok3.2_all.deb ...
Unpacking libwacom-common (1.3-ok3.2) ...
Selecting previously unselected package libwacom2:arm64.
Preparing to unpack .../121-libwacom2_1.3-ok3.2_arm64.deb ...
Unpacking libwacom2:arm64 (1.3-ok3.2) ...
Selecting previously unselected package libinput-bin.
Preparing to unpack .../122-libinput-bin_1.25.0-ok1.2_arm64.deb ...
Unpacking libinput-bin (1.25.0-ok1.2) ...
Selecting previously unselected package libmtdev1t64:arm64.
Preparing to unpack .../123-libmtdev1t64_1.1.6-ok1_arm64.deb ...
Unpacking libmtdev1t64:arm64 (1.1.6-ok1) ...
Selecting previously unselected package libinput10:arm64.
Preparing to unpack .../124-libinput10_1.25.0-ok1.2_arm64.deb ...
Unpacking libinput10:arm64 (1.25.0-ok1.2) ...
Selecting previously unselected package libjpeg62-turbo:arm64.
Preparing to unpack .../125-libjpeg62-turbo_1%3a2.1.2-ok2_arm64.deb ...
Unpacking libjpeg62-turbo:arm64 (1:2.1.2-ok2) ...
Selecting previously unselected package libmd4c0:arm64.
Preparing to unpack .../126-libmd4c0_0.4.8-ok1_arm64.deb ...
Unpacking libmd4c0:arm64 (0.4.8-ok1) ...
Selecting previously unselected package libpcre2-16-0:arm64.
Preparing to unpack .../127-libpcre2-16-0_10.42-4ok2_arm64.deb ...
Unpacking libpcre2-16-0:arm64 (10.42-4ok2) ...
Selecting previously unselected package shared-mime-info.
Preparing to unpack .../128-shared-mime-info_2.2-ok6.1_arm64.deb ...
Unpacking shared-mime-info (2.2-ok6.1) ...
Selecting previously unselected package libqt5core5a:arm64.
Preparing to unpack .../129-libqt5core5a_5.15.10+dfsg-3ok2.13_arm64.deb ...
Unpacking libqt5core5a:arm64 (5.15.10+dfsg-3ok2.13) ...
Selecting previously unselected package libqt5concurrent5:arm64.
Preparing to unpack .../130-libqt5concurrent5_5.15.10+dfsg-3ok2.13_arm64.deb ...
Unpacking libqt5concurrent5:arm64 (5.15.10+dfsg-3ok2.13) ...
Selecting previously unselected package libqt5dbus5:arm64.
Preparing to unpack .../131-libqt5dbus5_5.15.10+dfsg-3ok2.13_arm64.deb ...
Unpacking libqt5dbus5:arm64 (5.15.10+dfsg-3ok2.13) ...
Selecting previously unselected package libqt5network5:arm64.
Preparing to unpack .../132-libqt5network5_5.15.10+dfsg-3ok2.13_arm64.deb ...
Unpacking libqt5network5:arm64 (5.15.10+dfsg-3ok2.13) ...
Selecting previously unselected package libsm6:arm64.
Preparing to unpack .../133-libsm6_2%3a1.2.3-ok1_arm64.deb ...
Unpacking libsm6:arm64 (2:1.2.3-ok1) ...
Selecting previously unselected package libxcb-icccm4:arm64.
Preparing to unpack .../134-libxcb-icccm4_0.4.1-ok1_arm64.deb ...
Unpacking libxcb-icccm4:arm64 (0.4.1-ok1) ...
Selecting previously unselected package libxcb-util1:arm64.
Preparing to unpack .../135-libxcb-util1_0.4.0-ok2_arm64.deb ...
Unpacking libxcb-util1:arm64 (0.4.0-ok2) ...
Selecting previously unselected package libxcb-image0:arm64.
Preparing to unpack .../136-libxcb-image0_0.4.0-ok1_arm64.deb ...
Unpacking libxcb-image0:arm64 (0.4.0-ok1) ...
Selecting previously unselected package libxcb-keysyms1:arm64.
Preparing to unpack .../137-libxcb-keysyms1_0.4.0-ok1_arm64.deb ...
Unpacking libxcb-keysyms1:arm64 (0.4.0-ok1) ...
Selecting previously unselected package libxcb-render0:arm64.
Preparing to unpack .../138-libxcb-render0_1.15-ok2_arm64.deb ...
Unpacking libxcb-render0:arm64 (1.15-ok2) ...
Selecting previously unselected package libxcb-render-util0:arm64.
Preparing to unpack .../139-libxcb-render-util0_0.3.9-ok1_arm64.deb ...
Unpacking libxcb-render-util0:arm64 (0.3.9-ok1) ...
Selecting previously unselected package libxcb-shape0:arm64.
Preparing to unpack .../140-libxcb-shape0_1.15-ok2_arm64.deb ...
Unpacking libxcb-shape0:arm64 (1.15-ok2) ...
Selecting previously unselected package libxcb-xinerama0:arm64.
Preparing to unpack .../141-libxcb-xinerama0_1.15-ok2_arm64.deb ...
Unpacking libxcb-xinerama0:arm64 (1.15-ok2) ...
Selecting previously unselected package libxcb-xinput0:arm64.
Preparing to unpack .../142-libxcb-xinput0_1.15-ok2_arm64.deb ...
Unpacking libxcb-xinput0:arm64 (1.15-ok2) ...
Selecting previously unselected package libxcb-xkb1:arm64.
Preparing to unpack .../143-libxcb-xkb1_1.15-ok2_arm64.deb ...
Unpacking libxcb-xkb1:arm64 (1.15-ok2) ...
Selecting previously unselected package xkb-data.
Preparing to unpack .../144-xkb-data_2.41-ok1_all.deb ...
Unpacking xkb-data (2.41-ok1) ...
Selecting previously unselected package libxkbcommon0:arm64.
Preparing to unpack .../145-libxkbcommon0_1.5.0-ok1_arm64.deb ...
Unpacking libxkbcommon0:arm64 (1.5.0-ok1) ...
Selecting previously unselected package libxkbcommon-x11-0:arm64.
Preparing to unpack .../146-libxkbcommon-x11-0_1.5.0-ok1_arm64.deb ...
Unpacking libxkbcommon-x11-0:arm64 (1.5.0-ok1) ...
Selecting previously unselected package libxrender1:arm64.
Preparing to unpack .../147-libxrender1_1%3a0.9.10-ok1_arm64.deb ...
Unpacking libxrender1:arm64 (1:0.9.10-ok1) ...
Selecting previously unselected package libqt5gui5:arm64.
Preparing to unpack .../148-libqt5gui5_5.15.10+dfsg-3ok2.13_arm64.deb ...
Unpacking libqt5gui5:arm64 (5.15.10+dfsg-3ok2.13) ...
Selecting previously unselected package libqt5widgets5:arm64.
Preparing to unpack .../149-libqt5widgets5_5.15.10+dfsg-3ok2.13_arm64.deb ...
Unpacking libqt5widgets5:arm64 (5.15.10+dfsg-3ok2.13) ...
Selecting previously unselected package libqt5printsupport5:arm64.
Preparing to unpack .../150-libqt5printsupport5_5.15.10+dfsg-3ok2.13_arm64.deb ...
Unpacking libqt5printsupport5:arm64 (5.15.10+dfsg-3ok2.13) ...
Selecting previously unselected package libqt5sql5:arm64.
Preparing to unpack .../151-libqt5sql5_5.15.10+dfsg-3ok2.13_arm64.deb ...
Unpacking libqt5sql5:arm64 (5.15.10+dfsg-3ok2.13) ...
Selecting previously unselected package libqt5test5:arm64.
Preparing to unpack .../152-libqt5test5_5.15.10+dfsg-3ok2.13_arm64.deb ...
Unpacking libqt5test5:arm64 (5.15.10+dfsg-3ok2.13) ...
Selecting previously unselected package libqt5xml5:arm64.
Preparing to unpack .../153-libqt5xml5_5.15.10+dfsg-3ok2.13_arm64.deb ...
Unpacking libqt5xml5:arm64 (5.15.10+dfsg-3ok2.13) ...
Selecting previously unselected package libvulkan-dev:arm64.
Preparing to unpack .../154-libvulkan-dev_1.3.275.0-ok2_arm64.deb ...
Unpacking libvulkan-dev:arm64 (1.3.275.0-ok2) ...
Selecting previously unselected package libxext-dev:arm64.
Preparing to unpack .../155-libxext-dev_2%3a1.3.4-ok2_arm64.deb ...
Unpacking libxext-dev:arm64 (2:1.3.4-ok2) ...
Selecting previously unselected package qt5-qmake-bin.
Preparing to unpack .../156-qt5-qmake-bin_5.15.10+dfsg-3ok2.13_arm64.deb ...
Unpacking qt5-qmake-bin (5.15.10+dfsg-3ok2.13) ...
Selecting previously unselected package qtchooser.
Preparing to unpack .../157-qtchooser_66-ok2_arm64.deb ...
Unpacking qtchooser (66-ok2) ...
Selecting previously unselected package qt5-qmake:arm64.
Preparing to unpack .../158-qt5-qmake_5.15.10+dfsg-3ok2.13_arm64.deb ...
Unpacking qt5-qmake:arm64 (5.15.10+dfsg-3ok2.13) ...
Selecting previously unselected package qtbase5-dev-tools.
Preparing to unpack .../159-qtbase5-dev-tools_5.15.10+dfsg-3ok2.13_arm64.deb ...
Unpacking qtbase5-dev-tools (5.15.10+dfsg-3ok2.13) ...
Selecting previously unselected package qtbase5-dev:arm64.
Preparing to unpack .../160-qtbase5-dev_5.15.10+dfsg-3ok2.13_arm64.deb ...
Unpacking qtbase5-dev:arm64 (5.15.10+dfsg-3ok2.13) ...
Selecting previously unselected package sbuild-build-depends-kylin-ai-model-manager-dummy.
Preparing to unpack .../161-sbuild-build-depends-kylin-ai-model-manager-dummy_0.invalid.0_arm64.deb ...
Unpacking sbuild-build-depends-kylin-ai-model-manager-dummy (0.invalid.0) ...
Setting up media-types (10.1.0-ok1) ...
Setting up libpipeline1:arm64 (1.5.7-ok1) ...
Setting up libgraphite2-3:arm64 (1.3.14-ok1) ...
Setting up libwayland-server0:arm64 (1.23.0-1ok3) ...
Setting up libxau6:arm64 (1:1.0.9-ok1) ...
Setting up libxdmcp6:arm64 (1:1.1.3-ok1) ...
Setting up libdouble-conversion3:arm64 (3.3.0-ok1) ...
Setting up libxcb1:arm64 (1.15-ok2) ...
Setting up libxcb-xfixes0:arm64 (1.15-ok2) ...
Setting up libgdbm6t64:arm64 (1.23-ok5) ...
Setting up bsdextrautils (2.39.3-ok2build5) ...
Setting up libxcb-xinput0:arm64 (1.15-ok2) ...
Setting up libmagic-mgc (1:5.45-ok1) ...
Setting up libxcb-render0:arm64 (1.15-ok2) ...
Setting up libarchive-zip-perl (1.68-ok1) ...
Setting up libglvnd0:arm64 (1.7.0-ok1) ...
Setting up libxcb-glx0:arm64 (1.15-ok2) ...
Setting up libdebhelper-perl (13.15.3-ok1) ...
Setting up libbrotli1:arm64 (1.1.0-ok1) ...
Setting up libedit2:arm64 (3.1-20230828-ok1) ...
Setting up libuv1t64:arm64 (1.48.0-ok2) ...
Setting up libmagic1t64:arm64 (1:5.45-ok1) ...
Setting up libxcb-keysyms1:arm64 (0.4.0-ok1) ...
Setting up libxcb-shape0:arm64 (1.15-ok2) ...
Setting up x11-common (1:7.7+23-ok1) ...
Running in chroot, ignoring request.
invoke-rc.d: policy-rc.d denied execution of start.
Setting up libsensors-config (1:3.6.0-ok1) ...
Setting up libpsl5t64:arm64 (0.21.2-ok1.2) ...
Setting up libnghttp2-14:arm64 (1.59.0-ok2) ...
Setting up gettext-base (0.22-ok3) ...
Setting up m4 (1.4.19-ok1) ...
Setting up libxcb-render-util0:arm64 (0.3.9-ok1) ...
Setting up xkb-data (2.41-ok1) ...
Setting up libxcb-shm0:arm64 (1.15-ok2) ...
Setting up libxcb-icccm4:arm64 (0.4.1-ok1) ...
Setting up file (1:5.45-ok1) ...
Setting up libpthread-stubs0-dev:arm64 (0.4-ok2) ...
Setting up libpcre2-16-0:arm64 (10.42-4ok2) ...
Setting up libopengl0:arm64 (1.7.0-ok1) ...
Setting up libelf1t64:arm64 (0.190-ok3) ...
Setting up libxcb-util1:arm64 (0.4.0-ok2) ...
Setting up libxcb-xkb1:arm64 (1.15-ok2) ...
Setting up libxcb-image0:arm64 (0.4.0-ok1) ...
Setting up libsasl2-modules-db:arm64 (2.1.28+dfsg1-ok1) ...
Setting up libxcb-present0:arm64 (1.15-ok2) ...
Setting up xtrans-dev (1.4.0-ok1) ...
Setting up autotools-dev (20220506-ok1) ...
Setting up libglib2.0-0t64:arm64 (2.80.0-ok1.2~1128) ...
No schema files found: doing nothing.
Setting up libxcb-xinerama0:arm64 (1.15-ok2) ...
Setting up libjpeg62-turbo:arm64 (1:2.1.2-ok2) ...
Setting up qt5-qmake-bin (5.15.10+dfsg-3ok2.13) ...
Setting up libfreetype6:arm64 (2.13.2+dfsg-ok1) ...
Setting up libx11-data (2:1.8.7-ok1) ...
Setting up libxcb-sync1:arm64 (1.15-ok2) ...
Setting up librtmp1:arm64 (2.4+20151223.gitfa8646d.1-ok1) ...
Setting up libavahi-common-data:arm64 (0.8-ok1) ...
Setting up libdbus-1-3:arm64 (1.14.10-ok3) ...
Setting up autopoint (0.22-ok3) ...
Setting up libjsoncpp25:arm64 (1.9.5-ok2) ...
Setting up fonts-dejavu-core (2.37-ok1) ...
Setting up ucf (3.0043+nmu1-ok1) ...
Setting up libsensors5:arm64 (1:3.6.0-ok1) ...
Setting up libglapi-mesa:arm64 (24.0.5-ok1) ...
Setting up libsasl2-2:arm64 (2.1.28+dfsg1-ok1) ...
Setting up libvulkan1:arm64 (1.3.275.0-ok2) ...
Setting up autoconf (2.71-ok3) ...
Setting up libicu74:arm64 (74.2-ok6) ...
Setting up libxcb-dri2-0:arm64 (1.15-ok2) ...
Setting up dwz (0.15-1ok1) ...
Setting up libmtdev1t64:arm64 (1.1.6-ok1) ...
Setting up libxshmfence1:arm64 (1.3-ok1) ...
Setting up librhash0:arm64 (1.4.3-ok2) ...
Setting up libxcb-randr0:arm64 (1.15-ok2) ...
Setting up libuchardet0:arm64 (0.0.8-ok1) ...
Setting up libmd4c0:arm64 (0.4.8-ok1) ...
Setting up libsub-override-perl (0.10-ok1) ...
Setting up libx11-6:arm64 (2:1.8.7-ok1) ...
Setting up libharfbuzz0b:arm64 (8.3.0-ok2) ...
Setting up xorg-sgml-doctools (1:1.11-ok1) ...
Setting up netbase (6.4-ok1) ...
Setting up cmake-data (3.28.3-ok4) ...
Setting up libglu1-mesa:arm64 (9.0.2-ok1) ...
Setting up libssh2-1t64:arm64 (1.11.0-ok1) ...
Setting up libopengl-dev:arm64 (1.7.0-ok1) ...
Setting up libdrm-common (2.4.120-ok1) ...
Setting up libevdev2:arm64 (1.13.1+dfsg-ok1) ...
Setting up libldap2:arm64 (2.6.7+dfsg-ok1) ...
Setting up libgudev-1.0-0:arm64 (1:238-ok2) ...
Setting up qtchooser (66-ok2) ...
Setting up libicu70:arm64 (70.1-ok2) ...
Setting up libwacom-common (1.3-ok3.2) ...
Setting up libxkbcommon0:arm64 (1.5.0-ok1) ...
Setting up libwayland-client0:arm64 (1.23.0-1ok3) ...
Setting up automake (1:1.16.5-ok1) ...
update-alternatives: using /usr/bin/automake-1.16 to provide /usr/bin/automake (automake) in auto mode
Setting up x11proto-dev (2024.1-1ok3) ...
Setting up libfile-stripnondeterminism-perl (1.13.1-ok1) ...
Setting up libxcb-dri3-0:arm64 (1.15-ok2) ...
Setting up libx11-xcb1:arm64 (2:1.8.7-ok1) ...
Setting up libice6:arm64 (2:1.0.10-ok1) ...
Setting up libxau-dev:arm64 (1:1.0.9-ok1) ...
Setting up libpython3.12-stdlib:arm64 (3.12.2-ok4.1) ...
Setting up qt5-qmake:arm64 (5.15.10+dfsg-3ok2.13) ...
Setting up libxrender1:arm64 (1:0.9.10-ok1) ...
Setting up libtool (2.4.7-ok2) ...
Setting up fontconfig-config (2.15.0-ok5) ...
Setting up python3.12 (3.12.2-ok4.1) ...
Setting up libavahi-common3:arm64 (0.8-ok1) ...
Setting up libxext6:arm64 (2:1.3.4-ok2) ...
Setting up libxxf86vm1:arm64 (1:1.1.4-ok1) ...
Setting up dh-autoreconf (20-ok1) ...
Setting up libxdmcp-dev:arm64 (1:1.1.3-ok1) ...
Setting up libxfixes3:arm64 (1:6.0.0-ok1) ...
Setting up x11proto-core-dev (2024.1-1ok3) ...
Setting up libxkbcommon-x11-0:arm64 (1.5.0-ok1) ...
Setting up dh-strip-nondeterminism (1.13.1-ok1) ...
Setting up libdrm2:arm64 (2.4.120-ok1) ...
Setting up groff-base (1.23.0-3ok1) ...
Setting up libcurl4:arm64 (8.5.0-ok1.9) ...
Setting up libfontconfig1:arm64 (2.15.0-ok5) ...
Setting up libwacom2:arm64 (1.3-ok3.2) ...
Setting up libsm6:arm64 (2:1.2.3-ok1) ...
Setting up libxml2:arm64 (2.9.14+dfsg-ok2) ...
Setting up libavahi-client3:arm64 (0.8-ok1) ...
Setting up libpython3-stdlib:arm64 (3.12.2-ok1) ...
Setting up libdrm-amdgpu1:arm64 (2.4.120-ok1) ...
Setting up fontconfig (2.15.0-ok5) ...
Regenerating fonts cache... done.
Setting up libdrm-nouveau2:arm64 (2.4.120-ok1) ...
Setting up gettext (0.22-ok3) ...
Setting up libxcb1-dev:arm64 (1.15-ok2) ...
Setting up libgbm1:arm64 (24.0.5-ok1) ...
Setting up libdrm-radeon1:arm64 (2.4.120-ok1) ...
Setting up libx11-dev:arm64 (2:1.8.7-ok1) ...
Setting up python3 (3.12.2-ok1) ...
Setting up man-db (2.12.0-ok1) ...
Not building database; man-db/auto-update is not 'true'.
Created symlink /etc/systemd/system/timers.target.wants/man-db.timer → /usr/lib/systemd/system/man-db.timer.
Setting up libinput-bin (1.25.0-ok1.2) ...
Setting up intltool-debian (0.35.0+20060710.5-ok2) ...
Setting up libegl-mesa0:arm64 (24.0.5-ok1) ...
Setting up shared-mime-info (2.2-ok6.1) ...
Setting up libqt5core5a:arm64 (5.15.10+dfsg-3ok2.13) ...
Setting up libxext-dev:arm64 (2:1.3.4-ok2) ...
Setting up libqt5dbus5:arm64 (5.15.10+dfsg-3ok2.13) ...
Setting up libegl1:arm64 (1.7.0-ok1) ...
Setting up libqt5test5:arm64 (5.15.10+dfsg-3ok2.13) ...
Setting up libllvm17:arm64 (1:17.0.6-ok0) ...
Setting up libarchive13t64:arm64 (3.7.2-ok1) ...
Setting up libcups2t64:arm64 (2.4.7-ok2) ...
Setting up libqt5concurrent5:arm64 (5.15.10+dfsg-3ok2.13) ...
Setting up libinput10:arm64 (1.25.0-ok1.2) ...
Setting up libvulkan-dev:arm64 (1.3.275.0-ok2) ...
Setting up po-debconf (1.0.21+nmu1-ok1) ...
Setting up libgl1-mesa-dri:arm64 (24.0.5-ok1) ...
Setting up debhelper (13.15.3-ok1) ...
Setting up libqt5network5:arm64 (5.15.10+dfsg-3ok2.13) ...
Setting up libqt5sql5:arm64 (5.15.10+dfsg-3ok2.13) ...
Setting up qtbase5-dev-tools (5.15.10+dfsg-3ok2.13) ...
Setting up libqt5xml5:arm64 (5.15.10+dfsg-3ok2.13) ...
Setting up cmake (3.28.3-ok4) ...
Setting up libglx-mesa0:arm64 (24.0.5-ok1) ...
Setting up libglx0:arm64 (1.7.0-ok1) ...
Setting up libgl1:arm64 (1.7.0-ok1) ...
Setting up libglx-dev:arm64 (1.7.0-ok1) ...
Setting up libgl-dev:arm64 (1.7.0-ok1) ...
Setting up libegl-dev:arm64 (1.7.0-ok1) ...
Setting up libqt5gui5:arm64 (5.15.10+dfsg-3ok2.13) ...
Setting up libqt5widgets5:arm64 (5.15.10+dfsg-3ok2.13) ...
Setting up libqt5printsupport5:arm64 (5.15.10+dfsg-3ok2.13) ...
Setting up libglu1-mesa-dev:arm64 (9.0.2-ok1) ...
Setting up qtbase5-dev:arm64 (5.15.10+dfsg-3ok2.13) ...
Setting up sbuild-build-depends-kylin-ai-model-manager-dummy (0.invalid.0) ...
Processing triggers for systemd (255.2-ok1.12) ...
Processing triggers for libc-bin (2.38-1ok6.9) ...

+------------------------------------------------------------------------------+
| Build environment                                                            |
+------------------------------------------------------------------------------+

Kernel: Linux 4.19.90-23.15.v2101.ky10.aarch64 arm64 (aarch64)
Toolchain package versions: binutils_2.41-ok13 dpkg-dev_1.22.6-ok3 g++-12_12.3.0-1ok3 g++-9_9.3.0-ok12 gcc-12_12.3.0-1ok3 gcc-9_9.3.0-ok12 libc6-dev_2.38-1ok6.9 libstdc++-12-dev_12.3.0-1ok3 libstdc++-9-dev_9.3.0-ok12 libstdc++6_13.2.0-4ok3.3 linux-libc-dev_6.6.0-15.0ok13
Package versions: adduser_3.137-ok1 advancecomp_2.5-ok1 apt_2.8.0-ok2 autoconf_2.71-ok3 automake_1:1.16.5-ok1 autopoint_0.22-ok3 autotools-dev_20220506-ok1 base-files_13-ok2.2 base-passwd_3.6.3-ok2 bash_5.2.21-ok1 binutils_2.41-ok13 binutils-aarch64-linux-gnu_2.41-ok13 binutils-common_2.41-ok13 bsdextrautils_2.39.3-ok2build5 bsdutils_1:2.39.3-ok2build5 build-essential_12.8-ok1 bzip2_1.0.8.2-0k0 ca-certificates_20240203-ok1 cmake_3.28.3-ok4 cmake-data_3.28.3-ok4 coreutils_9.4-ok3 cpp_4:12.2.0-ok1 cpp-12_12.3.0-1ok3 cpp-9_9.3.0-ok12 dash_0.5.12-ok1 debconf_1.5.86-ok1 debhelper_13.15.3-ok1 debianutils_5.17-ok2 dh-autoreconf_20-ok1 dh-strip-nondeterminism_1.13.1-ok1 diffutils_1:3.7-ok1 dmsetup_2:1.02.196-ok2 dpkg_1.22.6-ok3 dpkg-dev_1.22.6-ok3 dwz_0.15-1ok1 e2fsprogs_1.47.0-ok1 fakeroot_1.30.1-ok2 fdisk_2.39.3-ok2build5 file_1:5.45-ok1 findutils_4.9.0-ok2 fontconfig_2.15.0-ok5 fontconfig-config_2.15.0-ok5 fonts-dejavu-core_2.37-ok1 g++_4:12.2.0-ok1 g++-12_12.3.0-1ok3 g++-9_9.3.0-ok12 gcc_4:12.2.0-ok1 gcc-10-base_10-20200411-ok5 gcc-12_12.3.0-1ok3 gcc-12-base_12.3.0-1ok3 gcc-13-base_13.2.0-4ok3.3 gcc-9_9.3.0-ok12 gcc-9-base_9.3.0-ok12 gettext_0.22-ok3 gettext-base_0.22-ok3 gpg_2.4.3-ok11 gpg-agent_2.4.3-ok11 gpgconf_2.4.3-ok11 gpgv_2.4.3-ok11 grep_3.11-ok3 groff-base_1.23.0-3ok1 gzip_1.12-1ok3 hostname_3.23-ok3 init_1.66-ok1 init-system-helpers_1.66-ok1 intltool-debian_0.35.0+20060710.5-ok2 libacl1_2.3.1-ok1 libapparmor1_4.0.0-beta3-ok1 libapt-pkg6.0t64_2.8.0-ok2 libarchive-zip-perl_1.68-ok1 libarchive13t64_3.7.2-ok1 libargon2-1_0~20190702+dfsg-ok1 libasan5_9.3.0-ok12 libasan8_13.2.0-4ok3.3 libassuan0_2.5.6-ok1 libatomic1_13.2.0-4ok3.3 libattr1_1:2.5.1-4ok1 libaudit-common_1:3.1.2-ok1.2 libaudit1_1:3.1.2-ok1.2 libavahi-client3_0.8-ok1 libavahi-common-data_0.8-ok1 libavahi-common3_0.8-ok1 libbinutils_2.41-ok13 libblkid1_2.39.3-ok2build5 libbrotli1_1.1.0-ok1 libbsd0_0.11.7-4ok1 libbz2-1.0_1.0.8.2-0k0 libc-bin_2.38-1ok6.9 libc-dev-bin_2.38-1ok6.9 libc6_2.38-1ok6.9 libc6-dev_2.38-1ok6.9 libcap-ng0_0.8.4-ok2 libcap2_1:2.69-1ok2 libcc1-0_13.2.0-4ok3.3 libcom-err2_1.47.0-ok1 libcrypt-dev_1:4.4.36-ok2 libcrypt1_1:4.4.36-ok2 libcryptsetup12_2:2.6.1-ok7 libctf-nobfd0_2.41-ok13 libctf0_2.41-ok13 libcups2t64_2.4.7-ok2 libcurl4_8.5.0-ok1.9 libdb5.3_5.3.28+dfsg1-ok1 libdbus-1-3_1.14.10-ok3 libdebconfclient0_0.271-ok1 libdebhelper-perl_13.15.3-ok1 libdevmapper1.02.1_2:1.02.196-ok2 libdouble-conversion3_3.3.0-ok1 libdpkg-perl_1.22.6-ok3 libdrm-amdgpu1_2.4.120-ok1 libdrm-common_2.4.120-ok1 libdrm-nouveau2_2.4.120-ok1 libdrm-radeon1_2.4.120-ok1 libdrm2_2.4.120-ok1 libedit2_3.1-20230828-ok1 libegl-dev_1.7.0-ok1 libegl-mesa0_24.0.5-ok1 libegl1_1.7.0-ok1 libelf1t64_0.190-ok3 libevdev2_1.13.1+dfsg-ok1 libexpat1_2.6.0-ok1 libext2fs2_1.47.0-ok1 libfakeroot_1.30.1-ok2 libfdisk1_2.39.3-ok2build5 libffi7_3.3-ok1 libffi8_3.4.6-ok2 libfile-stripnondeterminism-perl_1.13.1-ok1 libfontconfig1_2.15.0-ok5 libfreetype6_2.13.2+dfsg-ok1 libgbm1_24.0.5-ok1 libgcc-12-dev_12.3.0-1ok3 libgcc-9-dev_9.3.0-ok12 libgcc-s1_13.2.0-4ok3.3 libgcrypt20_1.10.3-ok2 libgdbm-compat4_1.18.1-ok2 libgdbm6t64_1.23-ok5 libgl-dev_1.7.0-ok1 libgl1_1.7.0-ok1 libgl1-mesa-dri_24.0.5-ok1 libglapi-mesa_24.0.5-ok1 libglib2.0-0t64_2.80.0-ok1.2~1128 libglu1-mesa_9.0.2-ok1 libglu1-mesa-dev_9.0.2-ok1 libglvnd0_1.7.0-ok1 libglx-dev_1.7.0-ok1 libglx-mesa0_24.0.5-ok1 libglx0_1.7.0-ok1 libgmp10_2:6.3.0+dfsg-ok5 libgnutls30t64_3.8.3-ok3 libgomp1_13.2.0-4ok3.3 libgpg-error0_1.47-ok1 libgprofng0_2.41-ok13 libgraphite2-3_1.3.14-ok1 libgssapi-krb5-2_1.20.1-ok1 libgudev-1.0-0_1:238-ok2 libharfbuzz0b_8.3.0-ok2 libhogweed5_3.5.1+really3.5.1-ok3 libhogweed6t64_3.9.1-ok2 libhwasan0_13.2.0-4ok3.3 libice6_2:1.0.10-ok1 libicu70_70.1-ok2 libicu74_74.2-ok6 libidn2-0_2.3.7-ok2 libinput-bin_1.25.0-ok1.2 libinput10_1.25.0-ok1.2 libip4tc2_1.8.10-ok1 libisl23_0.26-ok1 libitm1_13.2.0-4ok3.3 libjansson4_2.14-ok1 libjpeg62-turbo_1:2.1.2-ok2 libjson-c4_0.13.1+dfsg-ok1 libjson-c5_0.17-ok1 libjsoncpp25_1.9.5-ok2 libk5crypto3_1.20.1-ok1 libkeyutils1_1.6.3-ok2 libkmod2_30-ok2 libkrb5-3_1.20.1-ok1 libkrb5support0_1.20.1-ok1 libldap2_2.6.7+dfsg-ok1 libllvm17_1:17.0.6-ok0 liblockfile-bin_1.17-ok1 liblockfile1_1.17-ok1 liblsan0_13.2.0-4ok3.3 liblz4-1_1.9.4-1ok1 liblzma5_5.4.5-ok2 libmagic-mgc_1:5.45-ok1 libmagic1t64_1:5.45-ok1 libmd0_1.1.0-ok1 libmd4c0_0.4.8-ok1 libmount1_2.39.3-ok2build5 libmpc3_1.3.1-ok1 libmpfr6_4.2.1-ok4 libmtdev1t64_1.1.6-ok1 libncurses6_6.4+20240113-1ok1 libncursesw6_6.4+20240113-1ok1 libnettle7_3.5.1+really3.5.1-ok3 libnettle8t64_3.9.1-ok2 libnghttp2-14_1.59.0-ok2 libnpth0t64_1.6-ok2 libnsl-dev_2.0.0-ok2 libnsl2_2.0.0-ok2 libopengl-dev_1.7.0-ok1 libopengl0_1.7.0-ok1 libp11-kit0_0.25.3-ok1 libpam-modules_1.5.3-ok7 libpam-modules-bin_1.5.3-ok7 libpam-runtime_1.5.3-ok7 libpam0g_1.5.3-ok7 libpcre2-16-0_10.42-4ok2 libpcre2-8-0_10.42-4ok2 libpcre3_2:8.39-ok3 libperl5.30_5.30.0-ok4 libperl5.36_5.36.0-ok8.1 libpipeline1_1.5.7-ok1 libpng16-16t64_1.6.43-ok1 libproc2-0_2:4.0.4-ok1.0 libprocps8_2:3.3.16-ok1 libpsl5t64_0.21.2-ok1.2 libpthread-stubs0-dev_0.4-ok2 libpython3-stdlib_3.12.2-ok1 libpython3.12-minimal_3.12.2-ok4.1 libpython3.12-stdlib_3.12.2-ok4.1 libqt5concurrent5_5.15.10+dfsg-3ok2.13 libqt5core5a_5.15.10+dfsg-3ok2.13 libqt5dbus5_5.15.10+dfsg-3ok2.13 libqt5gui5_5.15.10+dfsg-3ok2.13 libqt5network5_5.15.10+dfsg-3ok2.13 libqt5printsupport5_5.15.10+dfsg-3ok2.13 libqt5sql5_5.15.10+dfsg-3ok2.13 libqt5test5_5.15.10+dfsg-3ok2.13 libqt5widgets5_5.15.10+dfsg-3ok2.13 libqt5xml5_5.15.10+dfsg-3ok2.13 libreadline8_8.2-ok1 librhash0_1.4.3-ok2 librtmp1_2.4+20151223.gitfa8646d.1-ok1 libsasl2-2_2.1.28+dfsg1-ok1 libsasl2-modules-db_2.1.28+dfsg1-ok1 libseccomp2_2.5.5-1ok1.3 libselinux1_3.5-ok2 libsemanage-common_3.5-ok1 libsemanage2_3.5-ok1 libsensors-config_1:3.6.0-ok1 libsensors5_1:3.6.0-ok1 libsepol1_3.0-ok1 libsepol2_3.5-ok1 libsframe1_2.41-ok13 libsm6_2:1.2.3-ok1 libsmartcols1_2.39.3-ok2build5 libsqlite3-0_3.42.0-ok1 libss2_1.47.0-ok1 libssh2-1t64_1.11.0-ok1 libssl1.1_1.1.1f-ok10 libssl3t64_3.2.1-ok7 libstdc++-12-dev_12.3.0-1ok3 libstdc++-9-dev_9.3.0-ok12 libstdc++6_13.2.0-4ok3.3 libsub-override-perl_0.10-ok1 libsystemd-shared_255.2-ok1.12 libsystemd0_255.2-ok1.12 libtasn1-6_4.19.0-ok1 libtinfo6_6.4+20240113-1ok1 libtirpc-common_1.3.4+ds-ok1 libtirpc-dev_1.3.4+ds-ok1 libtirpc3t64_1.3.4+ds-ok1 libtool_2.4.7-ok2 libtsan0_10-20200411-ok5 libtsan2_13.2.0-4ok3.3 libubsan1_13.2.0-4ok3.3 libuchardet0_0.0.8-ok1 libudev1_255.2-ok1.12 libunistring2_0.9.10-ok1 libunistring5_1.1-ok1 libuuid1_2.39.3-ok2build5 libuv1t64_1.48.0-ok2 libvulkan-dev_1.3.275.0-ok2 libvulkan1_1.3.275.0-ok2 libwacom-common_1.3-ok3.2 libwacom2_1.3-ok3.2 libwayland-client0_1.23.0-1ok3 libwayland-server0_1.23.0-1ok3 libx11-6_2:1.8.7-ok1 libx11-data_2:1.8.7-ok1 libx11-dev_2:1.8.7-ok1 libx11-xcb1_2:1.8.7-ok1 libxau-dev_1:1.0.9-ok1 libxau6_1:1.0.9-ok1 libxcb-dri2-0_1.15-ok2 libxcb-dri3-0_1.15-ok2 libxcb-glx0_1.15-ok2 libxcb-icccm4_0.4.1-ok1 libxcb-image0_0.4.0-ok1 libxcb-keysyms1_0.4.0-ok1 libxcb-present0_1.15-ok2 libxcb-randr0_1.15-ok2 libxcb-render-util0_0.3.9-ok1 libxcb-render0_1.15-ok2 libxcb-shape0_1.15-ok2 libxcb-shm0_1.15-ok2 libxcb-sync1_1.15-ok2 libxcb-util1_0.4.0-ok2 libxcb-xfixes0_1.15-ok2 libxcb-xinerama0_1.15-ok2 libxcb-xinput0_1.15-ok2 libxcb-xkb1_1.15-ok2 libxcb1_1.15-ok2 libxcb1-dev_1.15-ok2 libxdmcp-dev_1:1.1.3-ok1 libxdmcp6_1:1.1.3-ok1 libxext-dev_2:1.3.4-ok2 libxext6_2:1.3.4-ok2 libxfixes3_1:6.0.0-ok1 libxkbcommon-x11-0_1.5.0-ok1 libxkbcommon0_1.5.0-ok1 libxml2_2.9.14+dfsg-ok2 libxrender1_1:0.9.10-ok1 libxshmfence1_1.3-ok1 libxxf86vm1_1:1.1.4-ok1 libxxhash0_0.8.2-ok1 libzstd1_1.5.5-ok3 linux-libc-dev_6.6.0-15.0ok13 lockfile-progs_0.1.19-ok1 login_1:4.14.3-ok3.5 logsave_1.47.0-ok1 lsb-base_11.6-ok1 lto-disabled-list_24-ok21 m4_1.4.19-ok1 make_4.3-ok1 man-db_2.12.0-ok1 mawk_1.3.4.20240123-ok1 media-types_10.1.0-ok1 mount_2.39.3-ok2build5 ncurses-base_6.4+20240113-1ok1 ncurses-bin_6.4+20240113-1ok1 netbase_6.4-ok1 openkylin-keyring_2022.05.12-ok1 openssl_3.2.1-ok7 optipng_0.7.8+ds-ok1 passwd_1:4.14.3-ok3.5 patch_2.7.6-ok1 perl_5.36.0-ok8.1 perl-base_5.36.0-ok8.1 perl-modules-5.30_5.30.0-ok4 perl-modules-5.36_5.36.0-ok8.1 pinentry-curses_1.2.1-3ok5 pkgbinarymangler_154-ok3 po-debconf_1.0.21+nmu1-ok1 policyrcd-script-zg2_0.1-ok0 procps_2:4.0.4-ok1.0 python3_3.12.2-ok1 python3-minimal_3.12.2-ok1 python3.12_3.12.2-ok4.1 python3.12-minimal_3.12.2-ok4.1 qt5-qmake_5.15.10+dfsg-3ok2.13 qt5-qmake-bin_5.15.10+dfsg-3ok2.13 qtbase5-dev_5.15.10+dfsg-3ok2.13 qtbase5-dev-tools_5.15.10+dfsg-3ok2.13 qtchooser_66-ok2 readline-common_8.2-ok1 rpcsvc-proto_1.4.3-ok1 sbuild-build-depends-core-dummy_0.invalid.0 sbuild-build-depends-kylin-ai-model-manager-dummy_0.invalid.0 sed_4.9-2ok1 sensible-utils_0.0.22-ok1 shared-mime-info_2.2-ok6.1 systemd_255.2-ok1.12 systemd-dev_255.2-ok1.12 systemd-sysv_255.2-ok1.12 systemd-timesyncd_255.2-ok1.12 sysvinit-utils_3.08-ok1 tar_1.35+dfsg-ok1 tzdata_2024a-ok1 ubuntu-keyring_2023.11.28.1-ok1 ucf_3.0043+nmu1-ok1 util-linux_2.39.3-ok2build5 util-linux-extra_2.39.3-ok2build5 x11-common_1:7.7+23-ok1 x11proto-core-dev_2024.1-1ok3 x11proto-dev_2024.1-1ok3 xkb-data_2.41-ok1 xorg-sgml-doctools_1:1.11-ok1 xtrans-dev_1.4.0-ok1 xz-utils_5.4.5-ok2 zlib1g_1:1.3.dfsg-ok3

+------------------------------------------------------------------------------+
| Build                                                                        |
+------------------------------------------------------------------------------+


Unpack source
-------------

gpgv: Signature made Thu Mar  6 05:50:06 2025 UTC
gpgv:                using RSA key 64FBB79F5EAE64D792E94CFE0716F00F842CD274
gpgv: Can't check signature: No public key
dpkg-source: warning: cannot verify inline signature for ./kylin-ai-model-manager_0.0.0.1-ok11.dsc: no acceptable signature found
dpkg-source: info: extracting kylin-ai-model-manager in kylin-ai-model-manager-0.0.0.1
dpkg-source: info: unpacking kylin-ai-model-manager_0.0.0.1.orig.tar.gz
dpkg-source: info: unpacking kylin-ai-model-manager_0.0.0.1-ok11.debian.tar.xz
dpkg-source: info: using patch list from debian/patches/series
dpkg-source: info: applying 0001-kylin-ai-model-manager-0.0.0.1-ok3.patch
dpkg-source: info: applying 0002-udpate-bge-model-md5.patch
dpkg-source: info: applying 0003-kylin-ai-model-manager-0.0.0.1-ok5.patch
dpkg-source: info: applying 0004-kylin-ai-model-manager-0.0.0.1-ok6.patch
dpkg-source: info: applying 0005-update-data-kylin-ai-model-manager.desktop.patch
dpkg-source: info: applying 0006-1.patch
dpkg-source: info: applying 0007-changelog-com.kylin.ai.model.manager.patch
dpkg-source: info: applying 0008-mainwindow.cpp.patch

Check disc space
----------------

Sufficient free space for build

User Environment
----------------

APT_CONFIG=/var/lib/sbuild/apt.conf
DEB_BUILD_OPTIONS=noautodbgsym parallel=8
HOME=/sbuild-nonexistent
LANG=C.UTF-8
LC_ALL=C.UTF-8
LOGNAME=buildd
PATH=/usr/local/sbin:/usr/local/bin:/usr/sbin:/usr/bin:/sbin:/bin:/usr/games
SCHROOT_ALIAS_NAME=build-PACKAGEBUILD-287267
SCHROOT_CHROOT_NAME=build-PACKAGEBUILD-287267
SCHROOT_COMMAND=env
SCHROOT_GID=2501
SCHROOT_GROUP=buildd
SCHROOT_SESSION_ID=build-PACKAGEBUILD-287267
SCHROOT_UID=2001
SCHROOT_USER=buildd
SHELL=/bin/sh
TERM=unknown
USER=buildd
V=1

dpkg-buildpackage
-----------------

dpkg-buildpackage: info: source package kylin-ai-model-manager
dpkg-buildpackage: info: source version 0.0.0.1-ok11
dpkg-buildpackage: info: source distribution nile
 dpkg-source --before-build .
dpkg-buildpackage: info: host architecture arm64
dpkg-source: info: using options from kylin-ai-model-manager-0.0.0.1/debian/source/options: --include-binaries
 fakeroot debian/rules clean
dh clean  
   dh_clean
 debian/rules build-arch
dh build-arch  
   dh_update_autotools_config -a
   dh_autoreconf -a
   dh_auto_configure -a
	cd obj-aarch64-linux-gnu && DEB_PYTHON_INSTALL_LAYOUT=deb cmake -DCMAKE_INSTALL_PREFIX=/usr -DCMAKE_BUILD_TYPE=None -DCMAKE_INSTALL_SYSCONFDIR=/etc -DCMAKE_INSTALL_LOCALSTATEDIR=/var -DCMAKE_EXPORT_NO_PACKAGE_REGISTRY=ON -DCMAKE_FIND_USE_PACKAGE_REGISTRY=OFF -DCMAKE_FIND_PACKAGE_NO_PACKAGE_REGISTRY=ON -DFETCHCONTENT_FULLY_DISCONNECTED=ON -DCMAKE_INSTALL_RUNSTATEDIR=/run "-GUnix Makefiles" -DCMAKE_VERBOSE_MAKEFILE=ON -DCMAKE_INSTALL_LIBDIR=lib/aarch64-linux-gnu ..
-- The C compiler identification is GNU 12.3.0
-- The CXX compiler identification is GNU 12.3.0
-- Detecting C compiler ABI info
-- Detecting C compiler ABI info - done
-- Check for working C compiler: /usr/bin/cc - skipped
-- Detecting C compile features
-- Detecting C compile features - done
-- Detecting CXX compiler ABI info
-- Detecting CXX compiler ABI info - done
-- Check for working CXX compiler: /usr/bin/c++ - skipped
-- Detecting CXX compile features
-- Detecting CXX compile features - done
CMake Error at /usr/lib/aarch64-linux-gnu/cmake/Qt5/Qt5Config.cmake:28 (find_package):
  Could not find a package configuration file provided by "Qt5LinguistTools"
  with any of the following names:

    Qt5LinguistToolsConfig.cmake
    qt5linguisttools-config.cmake

  Add the installation prefix of "Qt5LinguistTools" to CMAKE_PREFIX_PATH or
  set "Qt5LinguistTools_DIR" to a directory containing one of the above
  files.  If "Qt5LinguistTools" provides a separate development package or
  SDK, be sure it has been installed.
Call Stack (most recent call first):
  CMakeLists.txt:29 (find_package)


-- Configuring incomplete, errors occurred!
	cd obj-aarch64-linux-gnu && tail -v -n \+0 CMakeCache.txt
==> CMakeCache.txt <==
# This is the CMakeCache file.
# For build in directory: /<<PKGBUILDDIR>>/obj-aarch64-linux-gnu
# It was generated by CMake: /usr/bin/cmake
# You can edit this file to change values found and used by cmake.
# If you do not want to change any of the values, simply exit the editor.
# If you do want to change a value, simply edit, save, and exit the editor.
# The syntax for the file is as follows:
# KEY:TYPE=VALUE
# KEY is the name of a variable in the cache.
# TYPE is a hint to GUIs for the type of VALUE, DO NOT EDIT TYPE!.
# VALUE is the current value for the KEY.

########################
# EXTERNAL cache entries
########################

//Path to a program.
CMAKE_ADDR2LINE:FILEPATH=/usr/bin/addr2line

//Path to a program.
CMAKE_AR:FILEPATH=/usr/bin/ar

//Choose the type of build, options are: None Debug Release RelWithDebInfo
// MinSizeRel ...
CMAKE_BUILD_TYPE:STRING=None

//Enable/Disable color output during build.
CMAKE_COLOR_MAKEFILE:BOOL=ON

//CXX compiler
CMAKE_CXX_COMPILER:FILEPATH=/usr/bin/c++

//A wrapper around 'ar' adding the appropriate '--plugin' option
// for the GCC compiler
CMAKE_CXX_COMPILER_AR:FILEPATH=/usr/bin/gcc-ar-12

//A wrapper around 'ranlib' adding the appropriate '--plugin' option
// for the GCC compiler
CMAKE_CXX_COMPILER_RANLIB:FILEPATH=/usr/bin/gcc-ranlib-12

//Flags used by the CXX compiler during all build types.
CMAKE_CXX_FLAGS:STRING=-g -O2 -ffile-prefix-map=/<<PKGBUILDDIR>>=. -flto=auto -ffat-lto-objects -flto=auto -ffat-lto-objects -fstack-protector-strong -Wformat -Werror=format-security -Wdate-time -D_FORTIFY_SOURCE=2

//Flags used by the CXX compiler during DEBUG builds.
CMAKE_CXX_FLAGS_DEBUG:STRING=-g

//Flags used by the CXX compiler during MINSIZEREL builds.
CMAKE_CXX_FLAGS_MINSIZEREL:STRING=-Os -DNDEBUG

//Flags used by the CXX compiler during NONE builds.
CMAKE_CXX_FLAGS_NONE:STRING=

//Flags used by the CXX compiler during RELEASE builds.
CMAKE_CXX_FLAGS_RELEASE:STRING=-O3 -DNDEBUG

//Flags used by the CXX compiler during RELWITHDEBINFO builds.
CMAKE_CXX_FLAGS_RELWITHDEBINFO:STRING=-O2 -g -DNDEBUG

//C compiler
CMAKE_C_COMPILER:FILEPATH=/usr/bin/cc

//A wrapper around 'ar' adding the appropriate '--plugin' option
// for the GCC compiler
CMAKE_C_COMPILER_AR:FILEPATH=/usr/bin/gcc-ar-12

//A wrapper around 'ranlib' adding the appropriate '--plugin' option
// for the GCC compiler
CMAKE_C_COMPILER_RANLIB:FILEPATH=/usr/bin/gcc-ranlib-12

//Flags used by the C compiler during all build types.
CMAKE_C_FLAGS:STRING=-g -O2 -ffile-prefix-map=/<<PKGBUILDDIR>>=. -flto=auto -ffat-lto-objects -flto=auto -ffat-lto-objects -fstack-protector-strong -Wformat -Werror=format-security -Wdate-time -D_FORTIFY_SOURCE=2

//Flags used by the C compiler during DEBUG builds.
CMAKE_C_FLAGS_DEBUG:STRING=-g

//Flags used by the C compiler during MINSIZEREL builds.
CMAKE_C_FLAGS_MINSIZEREL:STRING=-Os -DNDEBUG

//Flags used by the C compiler during NONE builds.
CMAKE_C_FLAGS_NONE:STRING=

//Flags used by the C compiler during RELEASE builds.
CMAKE_C_FLAGS_RELEASE:STRING=-O3 -DNDEBUG

//Flags used by the C compiler during RELWITHDEBINFO builds.
CMAKE_C_FLAGS_RELWITHDEBINFO:STRING=-O2 -g -DNDEBUG

//Path to a program.
CMAKE_DLLTOOL:FILEPATH=CMAKE_DLLTOOL-NOTFOUND

//Flags used by the linker during all build types.
CMAKE_EXE_LINKER_FLAGS:STRING=-flto=auto -ffat-lto-objects -flto=auto -Wl,-z,relro

//Flags used by the linker during DEBUG builds.
CMAKE_EXE_LINKER_FLAGS_DEBUG:STRING=

//Flags used by the linker during MINSIZEREL builds.
CMAKE_EXE_LINKER_FLAGS_MINSIZEREL:STRING=

//Flags used by the linker during NONE builds.
CMAKE_EXE_LINKER_FLAGS_NONE:STRING=

//Flags used by the linker during RELEASE builds.
CMAKE_EXE_LINKER_FLAGS_RELEASE:STRING=

//Flags used by the linker during RELWITHDEBINFO builds.
CMAKE_EXE_LINKER_FLAGS_RELWITHDEBINFO:STRING=

//Enable/Disable output of compile commands during generation.
CMAKE_EXPORT_COMPILE_COMMANDS:BOOL=

//No help, variable specified on the command line.
CMAKE_EXPORT_NO_PACKAGE_REGISTRY:UNINITIALIZED=ON

//No help, variable specified on the command line.
CMAKE_FIND_PACKAGE_NO_PACKAGE_REGISTRY:UNINITIALIZED=ON

//Value Computed by CMake.
CMAKE_FIND_PACKAGE_REDIRECTS_DIR:STATIC=/<<PKGBUILDDIR>>/obj-aarch64-linux-gnu/CMakeFiles/pkgRedirects

//No help, variable specified on the command line.
CMAKE_FIND_USE_PACKAGE_REGISTRY:UNINITIALIZED=OFF

//No help, variable specified on the command line.
CMAKE_INSTALL_LIBDIR:UNINITIALIZED=lib/aarch64-linux-gnu

//No help, variable specified on the command line.
CMAKE_INSTALL_LOCALSTATEDIR:UNINITIALIZED=/var

//Install path prefix, prepended onto install directories.
CMAKE_INSTALL_PREFIX:PATH=/usr

//No help, variable specified on the command line.
CMAKE_INSTALL_RUNSTATEDIR:UNINITIALIZED=/run

//No help, variable specified on the command line.
CMAKE_INSTALL_SYSCONFDIR:UNINITIALIZED=/etc

//Path to a program.
CMAKE_LINKER:FILEPATH=/usr/bin/ld

//Path to a program.
CMAKE_MAKE_PROGRAM:FILEPATH=/usr/bin/gmake

//Flags used by the linker during the creation of modules during
// all build types.
CMAKE_MODULE_LINKER_FLAGS:STRING=-flto=auto -ffat-lto-objects -flto=auto -Wl,-z,relro

//Flags used by the linker during the creation of modules during
// DEBUG builds.
CMAKE_MODULE_LINKER_FLAGS_DEBUG:STRING=

//Flags used by the linker during the creation of modules during
// MINSIZEREL builds.
CMAKE_MODULE_LINKER_FLAGS_MINSIZEREL:STRING=

//Flags used by the linker during the creation of modules during
// NONE builds.
CMAKE_MODULE_LINKER_FLAGS_NONE:STRING=

//Flags used by the linker during the creation of modules during
// RELEASE builds.
CMAKE_MODULE_LINKER_FLAGS_RELEASE:STRING=

//Flags used by the linker during the creation of modules during
// RELWITHDEBINFO builds.
CMAKE_MODULE_LINKER_FLAGS_RELWITHDEBINFO:STRING=

//Path to a program.
CMAKE_NM:FILEPATH=/usr/bin/nm

//Path to a program.
CMAKE_OBJCOPY:FILEPATH=/usr/bin/objcopy

//Path to a program.
CMAKE_OBJDUMP:FILEPATH=/usr/bin/objdump

//Value Computed by CMake
CMAKE_PROJECT_DESCRIPTION:STATIC=

//Value Computed by CMake
CMAKE_PROJECT_HOMEPAGE_URL:STATIC=

//Value Computed by CMake
CMAKE_PROJECT_NAME:STATIC=kylin-ai-model-manager

//Path to a program.
CMAKE_RANLIB:FILEPATH=/usr/bin/ranlib

//Path to a program.
CMAKE_READELF:FILEPATH=/usr/bin/readelf

//Flags used by the linker during the creation of shared libraries
// during all build types.
CMAKE_SHARED_LINKER_FLAGS:STRING=-flto=auto -ffat-lto-objects -flto=auto -Wl,-z,relro

//Flags used by the linker during the creation of shared libraries
// during DEBUG builds.
CMAKE_SHARED_LINKER_FLAGS_DEBUG:STRING=

//Flags used by the linker during the creation of shared libraries
// during MINSIZEREL builds.
CMAKE_SHARED_LINKER_FLAGS_MINSIZEREL:STRING=

//Flags used by the linker during the creation of shared libraries
// during NONE builds.
CMAKE_SHARED_LINKER_FLAGS_NONE:STRING=

//Flags used by the linker during the creation of shared libraries
// during RELEASE builds.
CMAKE_SHARED_LINKER_FLAGS_RELEASE:STRING=

//Flags used by the linker during the creation of shared libraries
// during RELWITHDEBINFO builds.
CMAKE_SHARED_LINKER_FLAGS_RELWITHDEBINFO:STRING=

//If set, runtime paths are not added when installing shared libraries,
// but are added when building.
CMAKE_SKIP_INSTALL_RPATH:BOOL=NO

//If set, runtime paths are not added when using shared libraries.
CMAKE_SKIP_RPATH:BOOL=NO

//Flags used by the linker during the creation of static libraries
// during all build types.
CMAKE_STATIC_LINKER_FLAGS:STRING=

//Flags used by the linker during the creation of static libraries
// during DEBUG builds.
CMAKE_STATIC_LINKER_FLAGS_DEBUG:STRING=

//Flags used by the linker during the creation of static libraries
// during MINSIZEREL builds.
CMAKE_STATIC_LINKER_FLAGS_MINSIZEREL:STRING=

//Flags used by the linker during the creation of static libraries
// during NONE builds.
CMAKE_STATIC_LINKER_FLAGS_NONE:STRING=

//Flags used by the linker during the creation of static libraries
// during RELEASE builds.
CMAKE_STATIC_LINKER_FLAGS_RELEASE:STRING=

//Flags used by the linker during the creation of static libraries
// during RELWITHDEBINFO builds.
CMAKE_STATIC_LINKER_FLAGS_RELWITHDEBINFO:STRING=

//Path to a program.
CMAKE_STRIP:FILEPATH=/usr/bin/strip

//Path to a program.
CMAKE_TAPI:FILEPATH=CMAKE_TAPI-NOTFOUND

//If this value is on, makefiles will be generated without the
// .SILENT directive, and all commands will be echoed to the console
// during the make.  This is useful for debugging only. With Visual
// Studio IDE projects all commands are done without /nologo.
CMAKE_VERBOSE_MAKEFILE:BOOL=ON

//No help, variable specified on the command line.
FETCHCONTENT_FULLY_DISCONNECTED:UNINITIALIZED=ON

//The directory containing a CMake configuration file for QT.
QT_DIR:PATH=/usr/lib/aarch64-linux-gnu/cmake/Qt5

//The directory containing a CMake configuration file for Qt5Core.
Qt5Core_DIR:PATH=/usr/lib/aarch64-linux-gnu/cmake/Qt5Core

//The directory containing a CMake configuration file for Qt5Gui.
Qt5Gui_DIR:PATH=/usr/lib/aarch64-linux-gnu/cmake/Qt5Gui

//The directory containing a CMake configuration file for Qt5LinguistTools.
Qt5LinguistTools_DIR:PATH=Qt5LinguistTools_DIR-NOTFOUND

//The directory containing a CMake configuration file for Qt5Widgets.
Qt5Widgets_DIR:PATH=/usr/lib/aarch64-linux-gnu/cmake/Qt5Widgets

//The directory containing a CMake configuration file for Qt5.
Qt5_DIR:PATH=/usr/lib/aarch64-linux-gnu/cmake/Qt5

//Value Computed by CMake
kylin-ai-model-manager_BINARY_DIR:STATIC=/<<PKGBUILDDIR>>/obj-aarch64-linux-gnu

//Value Computed by CMake
kylin-ai-model-manager_IS_TOP_LEVEL:STATIC=ON

//Value Computed by CMake
kylin-ai-model-manager_SOURCE_DIR:STATIC=/<<PKGBUILDDIR>>


########################
# INTERNAL cache entries
########################

//ADVANCED property for variable: CMAKE_ADDR2LINE
CMAKE_ADDR2LINE-ADVANCED:INTERNAL=1
//ADVANCED property for variable: CMAKE_AR
CMAKE_AR-ADVANCED:INTERNAL=1
//This is the directory where this CMakeCache.txt was created
CMAKE_CACHEFILE_DIR:INTERNAL=/<<PKGBUILDDIR>>/obj-aarch64-linux-gnu
//Major version of cmake used to create the current loaded cache
CMAKE_CACHE_MAJOR_VERSION:INTERNAL=3
//Minor version of cmake used to create the current loaded cache
CMAKE_CACHE_MINOR_VERSION:INTERNAL=28
//Patch version of cmake used to create the current loaded cache
CMAKE_CACHE_PATCH_VERSION:INTERNAL=3
//ADVANCED property for variable: CMAKE_COLOR_MAKEFILE
CMAKE_COLOR_MAKEFILE-ADVANCED:INTERNAL=1
//Path to CMake executable.
CMAKE_COMMAND:INTERNAL=/usr/bin/cmake
//Path to cpack program executable.
CMAKE_CPACK_COMMAND:INTERNAL=/usr/bin/cpack
//Path to ctest program executable.
CMAKE_CTEST_COMMAND:INTERNAL=/usr/bin/ctest
//ADVANCED property for variable: CMAKE_CXX_COMPILER
CMAKE_CXX_COMPILER-ADVANCED:INTERNAL=1
//ADVANCED property for variable: CMAKE_CXX_COMPILER_AR
CMAKE_CXX_COMPILER_AR-ADVANCED:INTERNAL=1
//ADVANCED property for variable: CMAKE_CXX_COMPILER_RANLIB
CMAKE_CXX_COMPILER_RANLIB-ADVANCED:INTERNAL=1
//ADVANCED property for variable: CMAKE_CXX_FLAGS
CMAKE_CXX_FLAGS-ADVANCED:INTERNAL=1
//ADVANCED property for variable: CMAKE_CXX_FLAGS_DEBUG
CMAKE_CXX_FLAGS_DEBUG-ADVANCED:INTERNAL=1
//ADVANCED property for variable: CMAKE_CXX_FLAGS_MINSIZEREL
CMAKE_CXX_FLAGS_MINSIZEREL-ADVANCED:INTERNAL=1
//ADVANCED property for variable: CMAKE_CXX_FLAGS_NONE
CMAKE_CXX_FLAGS_NONE-ADVANCED:INTERNAL=1
//ADVANCED property for variable: CMAKE_CXX_FLAGS_RELEASE
CMAKE_CXX_FLAGS_RELEASE-ADVANCED:INTERNAL=1
//ADVANCED property for variable: CMAKE_CXX_FLAGS_RELWITHDEBINFO
CMAKE_CXX_FLAGS_RELWITHDEBINFO-ADVANCED:INTERNAL=1
//ADVANCED property for variable: CMAKE_C_COMPILER
CMAKE_C_COMPILER-ADVANCED:INTERNAL=1
//ADVANCED property for variable: CMAKE_C_COMPILER_AR
CMAKE_C_COMPILER_AR-ADVANCED:INTERNAL=1
//ADVANCED property for variable: CMAKE_C_COMPILER_RANLIB
CMAKE_C_COMPILER_RANLIB-ADVANCED:INTERNAL=1
//ADVANCED property for variable: CMAKE_C_FLAGS
CMAKE_C_FLAGS-ADVANCED:INTERNAL=1
//ADVANCED property for variable: CMAKE_C_FLAGS_DEBUG
CMAKE_C_FLAGS_DEBUG-ADVANCED:INTERNAL=1
//ADVANCED property for variable: CMAKE_C_FLAGS_MINSIZEREL
CMAKE_C_FLAGS_MINSIZEREL-ADVANCED:INTERNAL=1
//ADVANCED property for variable: CMAKE_C_FLAGS_NONE
CMAKE_C_FLAGS_NONE-ADVANCED:INTERNAL=1
//ADVANCED property for variable: CMAKE_C_FLAGS_RELEASE
CMAKE_C_FLAGS_RELEASE-ADVANCED:INTERNAL=1
//ADVANCED property for variable: CMAKE_C_FLAGS_RELWITHDEBINFO
CMAKE_C_FLAGS_RELWITHDEBINFO-ADVANCED:INTERNAL=1
//ADVANCED property for variable: CMAKE_DLLTOOL
CMAKE_DLLTOOL-ADVANCED:INTERNAL=1
//Executable file format
CMAKE_EXECUTABLE_FORMAT:INTERNAL=ELF
//ADVANCED property for variable: CMAKE_EXE_LINKER_FLAGS
CMAKE_EXE_LINKER_FLAGS-ADVANCED:INTERNAL=1
//ADVANCED property for variable: CMAKE_EXE_LINKER_FLAGS_DEBUG
CMAKE_EXE_LINKER_FLAGS_DEBUG-ADVANCED:INTERNAL=1
//ADVANCED property for variable: CMAKE_EXE_LINKER_FLAGS_MINSIZEREL
CMAKE_EXE_LINKER_FLAGS_MINSIZEREL-ADVANCED:INTERNAL=1
//ADVANCED property for variable: CMAKE_EXE_LINKER_FLAGS_NONE
CMAKE_EXE_LINKER_FLAGS_NONE-ADVANCED:INTERNAL=1
//ADVANCED property for variable: CMAKE_EXE_LINKER_FLAGS_RELEASE
CMAKE_EXE_LINKER_FLAGS_RELEASE-ADVANCED:INTERNAL=1
//ADVANCED property for variable: CMAKE_EXE_LINKER_FLAGS_RELWITHDEBINFO
CMAKE_EXE_LINKER_FLAGS_RELWITHDEBINFO-ADVANCED:INTERNAL=1
//ADVANCED property for variable: CMAKE_EXPORT_COMPILE_COMMANDS
CMAKE_EXPORT_COMPILE_COMMANDS-ADVANCED:INTERNAL=1
//Name of external makefile project generator.
CMAKE_EXTRA_GENERATOR:INTERNAL=
//Name of generator.
CMAKE_GENERATOR:INTERNAL=Unix Makefiles
//Generator instance identifier.
CMAKE_GENERATOR_INSTANCE:INTERNAL=
//Name of generator platform.
CMAKE_GENERATOR_PLATFORM:INTERNAL=
//Name of generator toolset.
CMAKE_GENERATOR_TOOLSET:INTERNAL=
//Source directory with the top level CMakeLists.txt file for this
// project
CMAKE_HOME_DIRECTORY:INTERNAL=/<<PKGBUILDDIR>>
//Install .so files without execute permission.
CMAKE_INSTALL_SO_NO_EXE:INTERNAL=1
//ADVANCED property for variable: CMAKE_LINKER
CMAKE_LINKER-ADVANCED:INTERNAL=1
//ADVANCED property for variable: CMAKE_MAKE_PROGRAM
CMAKE_MAKE_PROGRAM-ADVANCED:INTERNAL=1
//ADVANCED property for variable: CMAKE_MODULE_LINKER_FLAGS
CMAKE_MODULE_LINKER_FLAGS-ADVANCED:INTERNAL=1
//ADVANCED property for variable: CMAKE_MODULE_LINKER_FLAGS_DEBUG
CMAKE_MODULE_LINKER_FLAGS_DEBUG-ADVANCED:INTERNAL=1
//ADVANCED property for variable: CMAKE_MODULE_LINKER_FLAGS_MINSIZEREL
CMAKE_MODULE_LINKER_FLAGS_MINSIZEREL-ADVANCED:INTERNAL=1
//ADVANCED property for variable: CMAKE_MODULE_LINKER_FLAGS_NONE
CMAKE_MODULE_LINKER_FLAGS_NONE-ADVANCED:INTERNAL=1
//ADVANCED property for variable: CMAKE_MODULE_LINKER_FLAGS_RELEASE
CMAKE_MODULE_LINKER_FLAGS_RELEASE-ADVANCED:INTERNAL=1
//ADVANCED property for variable: CMAKE_MODULE_LINKER_FLAGS_RELWITHDEBINFO
CMAKE_MODULE_LINKER_FLAGS_RELWITHDEBINFO-ADVANCED:INTERNAL=1
//ADVANCED property for variable: CMAKE_NM
CMAKE_NM-ADVANCED:INTERNAL=1
//number of local generators
CMAKE_NUMBER_OF_MAKEFILES:INTERNAL=1
//ADVANCED property for variable: CMAKE_OBJCOPY
CMAKE_OBJCOPY-ADVANCED:INTERNAL=1
//ADVANCED property for variable: CMAKE_OBJDUMP
CMAKE_OBJDUMP-ADVANCED:INTERNAL=1
//Platform information initialized
CMAKE_PLATFORM_INFO_INITIALIZED:INTERNAL=1
//ADVANCED property for variable: CMAKE_RANLIB
CMAKE_RANLIB-ADVANCED:INTERNAL=1
//ADVANCED property for variable: CMAKE_READELF
CMAKE_READELF-ADVANCED:INTERNAL=1
//Path to CMake installation.
CMAKE_ROOT:INTERNAL=/usr/share/cmake-3.28
//ADVANCED property for variable: CMAKE_SHARED_LINKER_FLAGS
CMAKE_SHARED_LINKER_FLAGS-ADVANCED:INTERNAL=1
//ADVANCED property for variable: CMAKE_SHARED_LINKER_FLAGS_DEBUG
CMAKE_SHARED_LINKER_FLAGS_DEBUG-ADVANCED:INTERNAL=1
//ADVANCED property for variable: CMAKE_SHARED_LINKER_FLAGS_MINSIZEREL
CMAKE_SHARED_LINKER_FLAGS_MINSIZEREL-ADVANCED:INTERNAL=1
//ADVANCED property for variable: CMAKE_SHARED_LINKER_FLAGS_NONE
CMAKE_SHARED_LINKER_FLAGS_NONE-ADVANCED:INTERNAL=1
//ADVANCED property for variable: CMAKE_SHARED_LINKER_FLAGS_RELEASE
CMAKE_SHARED_LINKER_FLAGS_RELEASE-ADVANCED:INTERNAL=1
//ADVANCED property for variable: CMAKE_SHARED_LINKER_FLAGS_RELWITHDEBINFO
CMAKE_SHARED_LINKER_FLAGS_RELWITHDEBINFO-ADVANCED:INTERNAL=1
//ADVANCED property for variable: CMAKE_SKIP_INSTALL_RPATH
CMAKE_SKIP_INSTALL_RPATH-ADVANCED:INTERNAL=1
//ADVANCED property for variable: CMAKE_SKIP_RPATH
CMAKE_SKIP_RPATH-ADVANCED:INTERNAL=1
//ADVANCED property for variable: CMAKE_STATIC_LINKER_FLAGS
CMAKE_STATIC_LINKER_FLAGS-ADVANCED:INTERNAL=1
//ADVANCED property for variable: CMAKE_STATIC_LINKER_FLAGS_DEBUG
CMAKE_STATIC_LINKER_FLAGS_DEBUG-ADVANCED:INTERNAL=1
//ADVANCED property for variable: CMAKE_STATIC_LINKER_FLAGS_MINSIZEREL
CMAKE_STATIC_LINKER_FLAGS_MINSIZEREL-ADVANCED:INTERNAL=1
//ADVANCED property for variable: CMAKE_STATIC_LINKER_FLAGS_NONE
CMAKE_STATIC_LINKER_FLAGS_NONE-ADVANCED:INTERNAL=1
//ADVANCED property for variable: CMAKE_STATIC_LINKER_FLAGS_RELEASE
CMAKE_STATIC_LINKER_FLAGS_RELEASE-ADVANCED:INTERNAL=1
//ADVANCED property for variable: CMAKE_STATIC_LINKER_FLAGS_RELWITHDEBINFO
CMAKE_STATIC_LINKER_FLAGS_RELWITHDEBINFO-ADVANCED:INTERNAL=1
//ADVANCED property for variable: CMAKE_STRIP
CMAKE_STRIP-ADVANCED:INTERNAL=1
//ADVANCED property for variable: CMAKE_TAPI
CMAKE_TAPI-ADVANCED:INTERNAL=1
//uname command
CMAKE_UNAME:INTERNAL=/usr/bin/uname
//ADVANCED property for variable: CMAKE_VERBOSE_MAKEFILE
CMAKE_VERBOSE_MAKEFILE-ADVANCED:INTERNAL=1
//linker supports push/pop state
_CMAKE_LINKER_PUSHPOP_STATE_SUPPORTED:INTERNAL=TRUE

dh_auto_configure: error: cd obj-aarch64-linux-gnu && DEB_PYTHON_INSTALL_LAYOUT=deb cmake -DCMAKE_INSTALL_PREFIX=/usr -DCMAKE_BUILD_TYPE=None -DCMAKE_INSTALL_SYSCONFDIR=/etc -DCMAKE_INSTALL_LOCALSTATEDIR=/var -DCMAKE_EXPORT_NO_PACKAGE_REGISTRY=ON -DCMAKE_FIND_USE_PACKAGE_REGISTRY=OFF -DCMAKE_FIND_PACKAGE_NO_PACKAGE_REGISTRY=ON -DFETCHCONTENT_FULLY_DISCONNECTED=ON -DCMAKE_INSTALL_RUNSTATEDIR=/run "-GUnix Makefiles" -DCMAKE_VERBOSE_MAKEFILE=ON -DCMAKE_INSTALL_LIBDIR=lib/aarch64-linux-gnu .. returned exit code 1
make: *** [debian/rules:9: build-arch] Error 2
dpkg-buildpackage: error: debian/rules build-arch subprocess returned exit status 2
--------------------------------------------------------------------------------
Build finished at 20250306-1536

Finished
--------

E: Build failure (dpkg-buildpackage died)

+------------------------------------------------------------------------------+
| Cleanup                                                                      |
+------------------------------------------------------------------------------+

Purging /<<BUILDDIR>>
Not removing build depends: as requested

+------------------------------------------------------------------------------+
| Summary                                                                      |
+------------------------------------------------------------------------------+

Build Architecture: arm64
Build-Space: 608
Build-Time: 3
Distribution: nile
Fail-Stage: build
Host Architecture: arm64
Install-Time: 52
Job: kylin-ai-model-manager_0.0.0.1-ok11.dsc
Machine Architecture: arm64
Package: kylin-ai-model-manager
Package-Time: 56
Source-Version: 0.0.0.1-ok11
Space: 608
Status: attempted
Version: 0.0.0.1-ok11
--------------------------------------------------------------------------------
Finished at 20250306-1536
Build needed 00:00:56, 608k disc space
Adding user buildd to group lxd
RUN: /usr/share/launchpad-buildd/bin/in-target scan-for-processes --backend=chroot --series=nile --arch=arm64 PACKAGEBUILD-287267
Scanning for processes to kill in build PACKAGEBUILD-287267
RUN: /usr/share/launchpad-buildd/bin/in-target umount-chroot --backend=chroot --series=nile --arch=arm64 PACKAGEBUILD-287267
Stopping target for build PACKAGEBUILD-287267
RUN: /usr/share/launchpad-buildd/bin/in-target remove-build --backend=chroot --series=nile --arch=arm64 PACKAGEBUILD-287267
Removing build PACKAGEBUILD-287267