https://build.openkylin.top/~cibot/+archive/openkylin/jenkins-ci-open-mr-8659/+build/288501
RUN: /usr/share/launchpad-buildd/bin/builder-prep 
Kernel version: Linux 1dbb9d95335a 5.15.0-119-generic #129~20.04.1-Ubuntu SMP Wed Aug 7 13:07:13 UTC 2024 x86_64
Buildd toolchain package versions: launchpad-buildd_203~505~kylin18.04.1k3 python-lpbuildd_203~505~kylin18.04.1k3 python3-lpbuildd_203~505~kylin18.04.1k3 sbuild_0.79.0-1ubuntu1 dpkg-dev_1.19.7ubuntu3 python-debian_0.1.36ubuntu1 python3-debian_0.1.36ubuntu1.
RUN: /usr/share/launchpad-buildd/bin/in-target unpack-chroot --backend=chroot --series=yangtze --arch=amd64 PACKAGEBUILD-288501 --image-type chroot /home/buildd/filecache-default/755c7ddf9d4c0328e96e33f2dc02089543e9f95e
Creating target for build PACKAGEBUILD-288501
RUN: /usr/share/launchpad-buildd/bin/in-target mount-chroot --backend=chroot --series=yangtze --arch=amd64 PACKAGEBUILD-288501
Starting target for build PACKAGEBUILD-288501
RUN: /usr/share/launchpad-buildd/bin/in-target override-sources-list --backend=chroot --series=yangtze --arch=amd64 PACKAGEBUILD-288501 'deb http://archive.build.openkylin.top/openkylin yangtze main' 'deb http://archive.build.openkylin.top/openkylin yangtze-security main' 'deb http://archive.build.openkylin.top/openkylin yangtze-updates main' 'deb http://archive.build.openkylin.top/openkylin yangtze-proposed main'
Can't find dpkg-alter package
Overriding sources.list in build-PACKAGEBUILD-288501
RUN: /usr/share/launchpad-buildd/bin/in-target add-trusted-keys --backend=chroot --series=yangtze --arch=amd64 PACKAGEBUILD-288501
Adding trusted keys to build-PACKAGEBUILD-288501
Warning: apt-key output should not be parsed (stdout is not a terminal)
OK
Warning: apt-key output should not be parsed (stdout is not a terminal)
/etc/apt/trusted.gpg
--------------------
pub   rsa4096 2022-05-12 [SC] [expires: 2032-05-09]
      09FF C10E A273 DD29 A986  B110 8B31 3CEA FF59 2D96
uid           [ unknown] openKylin Archive Signing Key <release-team@openkylin.top>
sub   rsa4096 2022-05-12 [E] [expires: 2032-05-09]

/etc/apt/trusted.gpg.d/ubuntu-keyring-2012-archive.gpg
------------------------------------------------------
pub   rsa4096 2012-05-11 [SC]
      790B C727 7767 219C 42C8  6F93 3B4F E6AC C0B2 1F32
uid           [ unknown] Ubuntu Archive Automatic Signing Key (2012) <ftpmaster@ubuntu.com>

/etc/apt/trusted.gpg.d/ubuntu-keyring-2012-cdimage.gpg
------------------------------------------------------
pub   rsa4096 2012-05-11 [SC]
      8439 38DF 228D 22F7 B374  2BC0 D94A A3F0 EFE2 1092
uid           [ unknown] Ubuntu CD Image Automatic Signing Key (2012) <cdimage@ubuntu.com>

/etc/apt/trusted.gpg.d/ubuntu-keyring-2018-archive.gpg
------------------------------------------------------
pub   rsa4096 2018-09-17 [SC]
      F6EC B376 2474 EDA9 D21B  7022 8719 20D1 991B C93C
uid           [ unknown] Ubuntu Archive Automatic Signing Key (2018) <ftpmaster@ubuntu.com>

RUN: /usr/share/launchpad-buildd/bin/in-target update-debian-chroot --backend=chroot --series=yangtze --arch=amd64 PACKAGEBUILD-288501
Updating target for build PACKAGEBUILD-288501
Get:1 http://archive.build.openkylin.top/openkylin yangtze InRelease [36.9 kB]
Get:2 http://archive.build.openkylin.top/openkylin yangtze-security InRelease [36.9 kB]
Get:3 http://archive.build.openkylin.top/openkylin yangtze-updates InRelease [36.9 kB]
Get:4 http://archive.build.openkylin.top/openkylin yangtze-proposed InRelease [77.6 kB]
Get:5 http://archive.build.openkylin.top/OTHER/Internal-mirror/repack5/baseok0.fix yangtze InRelease [6537 B]
Get:6 http://archive.build.openkylin.top/OTHER/Internal-mirror/stage0 yangtze InRelease [8361 B]
Get:7 http://archive.build.openkylin.top/openkylin yangtze/main amd64 Packages [2547 kB]
Get:8 http://archive.build.openkylin.top/openkylin yangtze-proposed/main amd64 Packages [1692 kB]
Get:9 http://archive.build.openkylin.top/openkylin yangtze-proposed/main Translation-en [452 kB]
Get:10 http://archive.build.openkylin.top/OTHER/Internal-mirror/repack5/baseok0.fix yangtze/main amd64 Packages [22.4 MB]
Get:11 http://archive.build.openkylin.top/OTHER/Internal-mirror/stage0 yangtze/main amd64 Packages [174 kB]
Fetched 27.5 MB in 5s (5640 kB/s)
Reading package lists...
Reading package lists...
Building dependency tree...
Reading state information...
Calculating upgrade...
The following packages were automatically installed and are no longer required:
  libffi7 libisl22 libsepol1
Use 'sudo apt autoremove' to remove them.
The following NEW packages will be installed:
  gcc-12-base libffi8 libgprofng0 libgssapi-krb5-2 libisl23 libjansson4
  libk5crypto3 libkeyutils1 libkrb5-3 libkrb5support0 libnsl-dev libnsl2
  libsepol2 libssl3 libsystemd-shared libtirpc-common libtirpc-dev libtirpc3
  libxxhash0 openkylin-keyring rpcsvc-proto util-linux-extra
The following packages will be upgraded:
  adduser advancecomp apt base-files bash binutils binutils-common
  binutils-x86-64-linux-gnu bsdutils build-essential bzip2 coreutils cpp cpp-9
  diffutils dpkg dpkg-dev fakeroot fdisk g++ g++-9 gcc gcc-9 gcc-9-base gzip
  libapt-pkg6.0 libasan5 libatomic1 libaudit-common libaudit1 libbinutils
  libblkid1 libbz2-1.0 libc-bin libc-dev-bin libc6 libc6-dev libcc1-0
  libcryptsetup12 libctf-nobfd0 libctf0 libdevmapper1.02.1 libdpkg-perl
  libfakeroot libfdisk1 libgcc-9-dev libgcc-s1 libgcrypt20 libgmp10
  libgnutls30 libgomp1 libhogweed5 libidn2-0 libip4tc2 libitm1 libkmod2
  liblockfile-bin liblockfile1 liblsan0 liblz4-1 liblzma5 libmount1
  libncurses6 libncursesw6 libnettle7 libp11-kit0 libpam-modules
  libpam-modules-bin libpam-runtime libpam0g libpcre2-8-0 libpcre3 libperl5.30
  libprocps8 libquadmath0 libreadline8 libseccomp2 libselinux1
  libsemanage-common libsemanage1 libsmartcols1 libsqlite3-0 libssl1.1
  libstdc++-9-dev libstdc++6 libsystemd0 libtasn1-6 libtinfo6 libubsan1
  libudev1 libunistring2 libuuid1 libzstd1 linux-libc-dev lockfile-progs login
  lto-disabled-list mount ncurses-base ncurses-bin openssl passwd perl
  perl-base perl-modules-5.30 pkgbinarymangler procps readline-common systemd
  systemd-sysv systemd-timesyncd sysvinit-utils tar ubuntu-keyring util-linux
  xz-utils zlib1g
117 upgraded, 22 newly installed, 0 to remove and 0 not upgraded.
Need to get 88.2 MB of archives.
After this operation, 55.4 MB of additional disk space will be used.
Get:1 http://archive.build.openkylin.top/openkylin yangtze/main amd64 libfakeroot amd64 1.30.1-ok2 [29.4 kB]
Get:2 http://archive.build.openkylin.top/openkylin yangtze/main amd64 fakeroot amd64 1.30.1-ok2 [61.9 kB]
Get:3 http://archive.build.openkylin.top/openkylin yangtze/main amd64 libc6-dev amd64 2.36-ok6 [2090 kB]
Get:4 http://archive.build.openkylin.top/openkylin yangtze/main amd64 libc-dev-bin amd64 2.36-ok6 [19.8 kB]
Get:5 http://archive.build.openkylin.top/openkylin yangtze/main amd64 rpcsvc-proto amd64 1.4.3-ok1 [65.2 kB]
Get:6 http://archive.build.openkylin.top/openkylin yangtze/main amd64 libc6 amd64 2.36-ok6 [3135 kB]
Get:7 http://archive.build.openkylin.top/openkylin yangtze/main amd64 libc-bin amd64 2.36-ok6 [674 kB]
Get:8 http://archive.build.openkylin.top/openkylin yangtze/main amd64 libkrb5support0 amd64 1.17-ok3 [30.9 kB]
Get:9 http://archive.build.openkylin.top/openkylin yangtze/main amd64 libk5crypto3 amd64 1.17-ok3 [87.5 kB]
Get:10 http://archive.build.openkylin.top/openkylin yangtze/main amd64 libkeyutils1 amd64 1.6-ok3 [8520 B]
Get:11 http://archive.build.openkylin.top/openkylin yangtze/main amd64 libssl1.1 amd64 1.1.1f-ok3 [1419 kB]
Get:12 http://archive.build.openkylin.top/openkylin yangtze/main amd64 libkrb5-3 amd64 1.17-ok3 [360 kB]
Get:13 http://archive.build.openkylin.top/openkylin yangtze/main amd64 libgssapi-krb5-2 amd64 1.17-ok3 [130 kB]
Get:14 http://archive.build.openkylin.top/openkylin yangtze/main amd64 libtirpc-common all 1.3.3-ok1 [9358 B]
Get:15 http://archive.build.openkylin.top/openkylin yangtze/main amd64 libtirpc3 amd64 1.3.3-ok1 [83.4 kB]
Get:16 http://archive.build.openkylin.top/openkylin yangtze/main amd64 libtirpc-dev amd64 1.3.3-ok1 [195 kB]
Get:17 http://archive.build.openkylin.top/openkylin yangtze/main amd64 libnsl2 amd64 2.0.0-ok1 [23.1 kB]
Get:18 http://archive.build.openkylin.top/openkylin yangtze/main amd64 libnsl-dev amd64 2.0.0-ok1 [30.9 kB]
Get:19 http://archive.build.openkylin.top/openkylin yangtze/main amd64 linux-libc-dev amd64 6.1.0-4.5ok1 [1364 kB]
Get:20 http://archive.build.openkylin.top/openkylin yangtze-proposed/main amd64 gcc-12-base amd64 12.2.0-ok8 [18.4 kB]
Get:21 http://archive.build.openkylin.top/openkylin yangtze-proposed/main amd64 libgcc-s1 amd64 12.2.0-ok8 [54.2 kB]
Get:22 http://archive.build.openkylin.top/openkylin yangtze/main amd64 base-files amd64 11-ok13.1 [59.6 kB]
Get:23 http://archive.build.openkylin.top/openkylin yangtze/main amd64 bash amd64 5.0-ok4 [1301 kB]
Get:24 http://archive.build.openkylin.top/openkylin yangtze/main amd64 bsdutils amd64 1:2.38.1-ok5build1 [88.2 kB]
Get:25 http://archive.build.openkylin.top/openkylin yangtze/main amd64 libpcre2-8-0 amd64 10.34-ok2 [157 kB]
Get:26 http://archive.build.openkylin.top/openkylin yangtze/main amd64 libselinux1 amd64 3.4-ok2 [72.4 kB]
Get:27 http://archive.build.openkylin.top/openkylin yangtze/main amd64 coreutils amd64 8.30-ok4 [2665 kB]
Get:28 http://archive.build.openkylin.top/openkylin yangtze/main amd64 diffutils amd64 1:3.7-ok2 [358 kB]
Get:29 http://archive.build.openkylin.top/openkylin yangtze/main amd64 libzstd1 amd64 1.5.2-ok2 [238 kB]
Get:30 http://archive.build.openkylin.top/openkylin yangtze/main amd64 tar amd64 1.30+dfsg-ok5 [581 kB]
Get:31 http://archive.build.openkylin.top/openkylin yangtze/main amd64 dpkg amd64 1.21.1-ok6.1 [1204 kB]
Get:32 http://archive.build.openkylin.top/openkylin yangtze-proposed/main amd64 gzip amd64 1.10-ok4 [90.8 kB]
Get:33 http://archive.build.openkylin.top/openkylin yangtze/main amd64 login amd64 1:4.8.1-ok3.1 [485 kB]
Get:34 http://archive.build.openkylin.top/openkylin yangtze/main amd64 ncurses-bin amd64 6.2-ok4 [177 kB]
Get:35 http://archive.build.openkylin.top/openkylin yangtze/main amd64 libperl5.30 amd64 5.30.0-ok6 [4530 kB]
Get:36 http://archive.build.openkylin.top/openkylin yangtze/main amd64 perl amd64 5.30.0-ok6 [226 kB]
Get:37 http://archive.build.openkylin.top/openkylin yangtze/main amd64 perl-base amd64 5.30.0-ok6 [1595 kB]
Get:38 http://archive.build.openkylin.top/openkylin yangtze/main amd64 perl-modules-5.30 all 5.30.0-ok6 [2901 kB]
Get:39 http://archive.build.openkylin.top/openkylin yangtze/main amd64 bzip2 amd64 1.0.8.2-0k0 [35.0 kB]
Get:40 http://archive.build.openkylin.top/openkylin yangtze/main amd64 libbz2-1.0 amd64 1.0.8.2-0k0 [34.2 kB]
Get:41 http://archive.build.openkylin.top/openkylin yangtze/main amd64 zlib1g amd64 1:1.2.11.dfsg-ok3 [58.4 kB]
Get:42 http://archive.build.openkylin.top/openkylin yangtze/main amd64 libblkid1 amd64 2.38.1-ok5build1 [136 kB]
Get:43 http://archive.build.openkylin.top/openkylin yangtze/main amd64 libmount1 amd64 2.38.1-ok5build1 [151 kB]
Get:44 http://archive.build.openkylin.top/openkylin yangtze/main amd64 libsmartcols1 amd64 2.38.1-ok5build1 [90.5 kB]
Get:45 http://archive.build.openkylin.top/openkylin yangtze/main amd64 libaudit-common all 1:2.8.5-ok3.1 [3096 B]
Get:46 http://archive.build.openkylin.top/openkylin yangtze/main amd64 libaudit1 amd64 1:2.8.5-ok3.1 [43.6 kB]
Get:47 http://archive.build.openkylin.top/openkylin yangtze/main amd64 libfdisk1 amd64 2.38.1-ok5build1 [175 kB]
Get:48 http://archive.build.openkylin.top/openkylin yangtze/main amd64 fdisk amd64 2.38.1-ok5build1 [133 kB]
Get:49 http://archive.build.openkylin.top/openkylin yangtze/main amd64 util-linux-extra amd64 2.38.1-ok5build1 [104 kB]
Get:50 http://archive.build.openkylin.top/openkylin yangtze/main amd64 util-linux amd64 2.38.1-ok5build1 [1204 kB]
Get:51 http://archive.build.openkylin.top/openkylin yangtze/main amd64 libuuid1 amd64 2.38.1-ok5build1 [17.7 kB]
Get:52 http://archive.build.openkylin.top/openkylin yangtze/main amd64 libncurses6 amd64 6.2-ok4 [109 kB]
Get:53 http://archive.build.openkylin.top/openkylin yangtze/main amd64 libncursesw6 amd64 6.2-ok4 [146 kB]
Get:54 http://archive.build.openkylin.top/openkylin yangtze/main amd64 libtinfo6 amd64 6.2-ok4 [96.5 kB]
Get:55 http://archive.build.openkylin.top/openkylin yangtze/main amd64 readline-common all 8.0-ok2 [52.4 kB]
Get:56 http://archive.build.openkylin.top/openkylin yangtze/main amd64 libreadline8 amd64 8.0-ok2 [140 kB]
Get:57 http://archive.build.openkylin.top/openkylin yangtze/main amd64 ncurses-base all 6.2-ok4 [18.1 kB]
Get:58 http://archive.build.openkylin.top/openkylin yangtze/main amd64 sysvinit-utils amd64 2.96-ok5 [20.9 kB]
Get:59 http://archive.build.openkylin.top/openkylin yangtze/main amd64 libxxhash0 amd64 0.8.1-ok1 [25.8 kB]
Get:60 http://archive.build.openkylin.top/openkylin yangtze/main amd64 libgcrypt20 amd64 1.8.5-ok5 [426 kB]
Get:61 http://archive.build.openkylin.top/openkylin yangtze/main amd64 liblz4-1 amd64 1.9.2-ok3 [59.8 kB]
Get:62 http://archive.build.openkylin.top/openkylin yangtze/main amd64 liblzma5 amd64 5.2.4-ok6 [85.1 kB]
Get:63 http://archive.build.openkylin.top/openkylin yangtze-proposed/main amd64 libstdc++6 amd64 12.2.0-ok8 [669 kB]
Get:64 http://archive.build.openkylin.top/openkylin yangtze/main amd64 libssl3 amd64 3.0.8-ok4.1 [1853 kB]
Get:65 http://archive.build.openkylin.top/openkylin yangtze/main amd64 libip4tc2 amd64 1.8.4-ok2 [18.2 kB]
Get:66 http://archive.build.openkylin.top/openkylin yangtze/main amd64 libkmod2 amd64 27-ok2.1 [40.4 kB]
Get:67 http://archive.build.openkylin.top/openkylin yangtze/main amd64 libpam0g amd64 1.3.1-ok3 [56.1 kB]
Get:68 http://archive.build.openkylin.top/openkylin yangtze/main amd64 libseccomp2 amd64 2.5.3-ok2 [57.0 kB]
Get:69 http://archive.build.openkylin.top/openkylin yangtze/main amd64 libsystemd-shared amd64 251.4-ok1.7 [1705 kB]
Get:70 http://archive.build.openkylin.top/openkylin yangtze/main amd64 systemd-sysv amd64 251.4-ok1.7 [11.1 kB]
Get:71 http://archive.build.openkylin.top/openkylin yangtze/main amd64 libsepol2 amd64 3.4-ok2 [269 kB]
Get:72 http://archive.build.openkylin.top/openkylin yangtze/main amd64 libsemanage-common all 3.0-ok2 [8192 B]
Get:73 http://archive.build.openkylin.top/openkylin yangtze/main amd64 libsemanage1 amd64 3.0-ok2 [91.0 kB]
Get:74 http://archive.build.openkylin.top/openkylin yangtze/main amd64 libpam-modules-bin amd64 1.3.1-ok3 [37.7 kB]
Get:75 http://archive.build.openkylin.top/openkylin yangtze/main amd64 libpam-modules amd64 1.3.1-ok3 [260 kB]
Get:76 http://archive.build.openkylin.top/openkylin yangtze/main amd64 passwd amd64 1:4.8.1-ok3.1 [786 kB]
Get:77 http://archive.build.openkylin.top/openkylin yangtze/main amd64 adduser all 3.118-ok4 [218 kB]
Get:78 http://archive.build.openkylin.top/openkylin yangtze/main amd64 systemd-timesyncd amd64 251.4-ok1.7 [33.6 kB]
Get:79 http://archive.build.openkylin.top/openkylin yangtze/main amd64 libudev1 amd64 251.4-ok1.7 [87.6 kB]
Get:80 http://archive.build.openkylin.top/openkylin yangtze/main amd64 libdevmapper1.02.1 amd64 2:1.02.167-ok3 [135 kB]
Get:81 http://archive.build.openkylin.top/openkylin yangtze/main amd64 libcryptsetup12 amd64 2:2.2.2-ok6 [186 kB]
Get:82 http://archive.build.openkylin.top/openkylin yangtze/main amd64 mount amd64 2.38.1-ok5build1 [127 kB]
Get:83 http://archive.build.openkylin.top/openkylin yangtze/main amd64 systemd amd64 251.4-ok1.7 [2876 kB]
Get:84 http://archive.build.openkylin.top/openkylin yangtze/main amd64 libsystemd0 amd64 251.4-ok1.7 [332 kB]
Get:85 http://archive.build.openkylin.top/openkylin yangtze/main amd64 libapt-pkg6.0 amd64 2.5.4-ok6.2 [939 kB]
Get:86 http://archive.build.openkylin.top/openkylin yangtze/main amd64 openkylin-keyring all 2022.05.12-ok1 [3662 B]
Get:87 http://archive.build.openkylin.top/openkylin yangtze/main amd64 libgmp10 amd64 2:6.2.0+dfsg-ok3 [255 kB]
Get:88 http://archive.build.openkylin.top/openkylin yangtze/main amd64 libnettle7 amd64 3.5.1+really3.5.1-ok3 [115 kB]
Get:89 http://archive.build.openkylin.top/openkylin yangtze/main amd64 libhogweed5 amd64 3.5.1+really3.5.1-ok3 [137 kB]
Get:90 http://archive.build.openkylin.top/openkylin yangtze/main amd64 libunistring2 amd64 0.9.10-ok2 [486 kB]
Get:91 http://archive.build.openkylin.top/openkylin yangtze/main amd64 libidn2-0 amd64 2.2.0-ok2 [76.9 kB]
Get:92 http://archive.build.openkylin.top/openkylin yangtze/main amd64 libffi8 amd64 3.4.4-ok4 [22.6 kB]
Get:93 http://archive.build.openkylin.top/openkylin yangtze/main amd64 libp11-kit0 amd64 0.23.20-ok2 [222 kB]
Get:94 http://archive.build.openkylin.top/openkylin yangtze/main amd64 libtasn1-6 amd64 4.16.0-ok3 [38.2 kB]
Get:95 http://archive.build.openkylin.top/openkylin yangtze/main amd64 libgnutls30 amd64 3.6.13-ok12.1 [948 kB]
Get:96 http://archive.build.openkylin.top/openkylin yangtze/main amd64 apt amd64 2.5.4-ok6.2 [1360 kB]
Get:97 http://archive.build.openkylin.top/openkylin yangtze/main amd64 libpam-runtime all 1.3.1-ok3 [151 kB]
Get:98 http://archive.build.openkylin.top/openkylin yangtze/main amd64 libpcre3 amd64 2:8.39-ok5 [241 kB]
Get:99 http://archive.build.openkylin.top/openkylin yangtze/main amd64 ubuntu-keyring all 2020.02.11.2-ok2 [21.0 kB]
Get:100 http://archive.build.openkylin.top/openkylin yangtze/main amd64 libisl23 amd64 0.25-ok1 [737 kB]
Get:101 http://archive.build.openkylin.top/openkylin yangtze/main amd64 g++-9 amd64 9.3.0-ok12 [8664 kB]
Get:102 http://archive.build.openkylin.top/openkylin yangtze/main amd64 gcc-9 amd64 9.3.0-ok12 [8475 kB]
Get:103 http://archive.build.openkylin.top/openkylin yangtze/main amd64 cpp-9 amd64 9.3.0-ok12 [8046 kB]
Get:104 http://archive.build.openkylin.top/openkylin yangtze-proposed/main amd64 libcc1-0 amd64 12.2.0-ok8 [45.1 kB]
Get:105 http://archive.build.openkylin.top/openkylin yangtze/main amd64 libctf0 amd64 2.39.50.20221224-ok6 [84.3 kB]
Get:106 http://archive.build.openkylin.top/openkylin yangtze/main amd64 binutils-x86-64-linux-gnu amd64 2.39.50.20221224-ok6 [2479 kB]
Get:107 http://archive.build.openkylin.top/openkylin yangtze/main amd64 libbinutils amd64 2.39.50.20221224-ok6 [571 kB]
Get:108 http://archive.build.openkylin.top/openkylin yangtze/main amd64 binutils amd64 2.39.50.20221224-ok6 [3238 B]
Get:109 http://archive.build.openkylin.top/openkylin yangtze/main amd64 binutils-common amd64 2.39.50.20221224-ok6 [2549 kB]
Get:110 http://archive.build.openkylin.top/openkylin yangtze/main amd64 libctf-nobfd0 amd64 2.39.50.20221224-ok6 [86.9 kB]
Get:111 http://archive.build.openkylin.top/openkylin yangtze/main amd64 libgprofng0 amd64 2.39.50.20221224-ok6 [851 kB]
Get:112 http://archive.build.openkylin.top/openkylin yangtze/main amd64 libjansson4 amd64 2.12-ok1 [28.3 kB]
Get:113 http://archive.build.openkylin.top/openkylin yangtze-proposed/main amd64 libgomp1 amd64 12.2.0-ok8 [124 kB]
Get:114 http://archive.build.openkylin.top/openkylin yangtze-proposed/main amd64 libitm1 amd64 12.2.0-ok8 [28.9 kB]
Get:115 http://archive.build.openkylin.top/openkylin yangtze-proposed/main amd64 libatomic1 amd64 12.2.0-ok8 [10.2 kB]
Get:116 http://archive.build.openkylin.top/openkylin yangtze/main amd64 libasan5 amd64 9.3.0-ok12 [428 kB]
Get:117 http://archive.build.openkylin.top/openkylin yangtze-proposed/main amd64 liblsan0 amd64 12.2.0-ok8 [1053 kB]
Get:118 http://archive.build.openkylin.top/openkylin yangtze-proposed/main amd64 libubsan1 amd64 12.2.0-ok8 [960 kB]
Get:119 http://archive.build.openkylin.top/openkylin yangtze-proposed/main amd64 libquadmath0 amd64 12.2.0-ok8 [151 kB]
Get:120 http://archive.build.openkylin.top/openkylin yangtze/main amd64 libstdc++-9-dev amd64 9.3.0-ok12 [1795 kB]
Get:121 http://archive.build.openkylin.top/openkylin yangtze/main amd64 libgcc-9-dev amd64 9.3.0-ok12 [2472 kB]
Get:122 http://archive.build.openkylin.top/openkylin yangtze/main amd64 gcc-9-base amd64 9.3.0-ok12 [20.3 kB]
Get:123 http://archive.build.openkylin.top/openkylin yangtze/main amd64 libprocps8 amd64 2:3.3.16-ok4.3 [33.1 kB]
Get:124 http://archive.build.openkylin.top/openkylin yangtze/main amd64 procps amd64 2:3.3.16-ok4.3 [234 kB]
Get:125 http://archive.build.openkylin.top/openkylin yangtze/main amd64 liblockfile-bin amd64 1.17-ok1 [21.6 kB]
Get:126 http://archive.build.openkylin.top/openkylin yangtze/main amd64 liblockfile1 amd64 1.17-ok1 [17.6 kB]
Get:127 http://archive.build.openkylin.top/openkylin yangtze/main amd64 xz-utils amd64 5.2.4-ok6 [113 kB]
Get:128 http://archive.build.openkylin.top/openkylin yangtze/main amd64 advancecomp amd64 2.5-ok1 [194 kB]
Get:129 http://archive.build.openkylin.top/openkylin yangtze/main amd64 g++ amd64 4:9.3.0-ok7 [1482 B]
Get:130 http://archive.build.openkylin.top/openkylin yangtze/main amd64 gcc amd64 4:9.3.0-ok7 [5148 B]
Get:131 http://archive.build.openkylin.top/openkylin yangtze/main amd64 cpp amd64 4:9.3.0-ok7 [5762 B]
Get:132 http://archive.build.openkylin.top/openkylin yangtze/main amd64 dpkg-dev all 1.21.1-ok6.1 [922 kB]
Get:133 http://archive.build.openkylin.top/openkylin yangtze/main amd64 libdpkg-perl all 1.21.1-ok6.1 [336 kB]
Get:134 http://archive.build.openkylin.top/openkylin yangtze-proposed/main amd64 lto-disabled-list all 24-ok19 [12.0 kB]
Get:135 http://archive.build.openkylin.top/openkylin yangtze/main amd64 build-essential amd64 12.8-ok1 [4004 B]
Get:136 http://archive.build.openkylin.top/openkylin yangtze/main amd64 libsqlite3-0 amd64 3.39.4-ok4 [637 kB]
Get:137 http://archive.build.openkylin.top/openkylin yangtze/main amd64 lockfile-progs amd64 0.1.19-ok1 [15.4 kB]
Get:138 http://archive.build.openkylin.top/openkylin yangtze/main amd64 openssl amd64 3.0.8-ok4.1 [1148 kB]
Get:139 http://archive.build.openkylin.top/openkylin yangtze/main amd64 pkgbinarymangler all 150-ok1 [15.2 kB]
debconf: delaying package configuration, since apt-utils is not installed
Fetched 88.2 MB in 18s (4887 kB/s)
(Reading database ... 12871 files and directories currently installed.)
Preparing to unpack .../0-libfakeroot_1.30.1-ok2_amd64.deb ...
Unpacking libfakeroot:amd64 (1.30.1-ok2) over (1.24-ok0) ...
Preparing to unpack .../1-fakeroot_1.30.1-ok2_amd64.deb ...
Unpacking fakeroot (1.30.1-ok2) over (1.24-ok0) ...
Preparing to unpack .../2-libc6-dev_2.36-ok6_amd64.deb ...
Unpacking libc6-dev:amd64 (2.36-ok6) over (2.31-ok1) ...
Preparing to unpack .../3-libc-dev-bin_2.36-ok6_amd64.deb ...
Unpacking libc-dev-bin (2.36-ok6) over (2.31-ok1) ...
Selecting previously unselected package rpcsvc-proto.
Preparing to unpack .../4-rpcsvc-proto_1.4.3-ok1_amd64.deb ...
Unpacking rpcsvc-proto (1.4.3-ok1) ...
Preparing to unpack .../5-libc6_2.36-ok6_amd64.deb ...
Unpacking libc6:amd64 (2.36-ok6) over (2.31-ok1) ...
Setting up libc6:amd64 (2.36-ok6) ...
(Reading database ... 12833 files and directories currently installed.)
Preparing to unpack .../libc-bin_2.36-ok6_amd64.deb ...
Unpacking libc-bin (2.36-ok6) over (2.31-ok1) ...
Setting up libc-bin (2.36-ok6) ...
Selecting previously unselected package libkrb5support0:amd64.
(Reading database ... 12831 files and directories currently installed.)
Preparing to unpack .../libkrb5support0_1.17-ok3_amd64.deb ...
Unpacking libkrb5support0:amd64 (1.17-ok3) ...
Setting up libkrb5support0:amd64 (1.17-ok3) ...
Selecting previously unselected package libk5crypto3:amd64.
(Reading database ... 12836 files and directories currently installed.)
Preparing to unpack .../libk5crypto3_1.17-ok3_amd64.deb ...
Unpacking libk5crypto3:amd64 (1.17-ok3) ...
Setting up libk5crypto3:amd64 (1.17-ok3) ...
Selecting previously unselected package libkeyutils1:amd64.
(Reading database ... 12841 files and directories currently installed.)
Preparing to unpack .../libkeyutils1_1.6-ok3_amd64.deb ...
Unpacking libkeyutils1:amd64 (1.6-ok3) ...
Setting up libkeyutils1:amd64 (1.6-ok3) ...
(Reading database ... 12846 files and directories currently installed.)
Preparing to unpack .../libssl1.1_1.1.1f-ok3_amd64.deb ...
Unpacking libssl1.1:amd64 (1.1.1f-ok3) over (1.1.1f-ok1) ...
Setting up libssl1.1:amd64 (1.1.1f-ok3) ...
Selecting previously unselected package libkrb5-3:amd64.
(Reading database ... 12846 files and directories currently installed.)
Preparing to unpack .../libkrb5-3_1.17-ok3_amd64.deb ...
Unpacking libkrb5-3:amd64 (1.17-ok3) ...
Setting up libkrb5-3:amd64 (1.17-ok3) ...
Selecting previously unselected package libgssapi-krb5-2:amd64.
(Reading database ... 12859 files and directories currently installed.)
Preparing to unpack .../libgssapi-krb5-2_1.17-ok3_amd64.deb ...
Unpacking libgssapi-krb5-2:amd64 (1.17-ok3) ...
Setting up libgssapi-krb5-2:amd64 (1.17-ok3) ...
Selecting previously unselected package libtirpc-common.
(Reading database ... 12867 files and directories currently installed.)
Preparing to unpack .../libtirpc-common_1.3.3-ok1_all.deb ...
Unpacking libtirpc-common (1.3.3-ok1) ...
Setting up libtirpc-common (1.3.3-ok1) ...
Selecting previously unselected package libtirpc3:amd64.
(Reading database ... 12872 files and directories currently installed.)
Preparing to unpack .../libtirpc3_1.3.3-ok1_amd64.deb ...
Unpacking libtirpc3:amd64 (1.3.3-ok1) ...
Setting up libtirpc3:amd64 (1.3.3-ok1) ...
Selecting previously unselected package libtirpc-dev:amd64.
(Reading database ... 12877 files and directories currently installed.)
Preparing to unpack .../libtirpc-dev_1.3.3-ok1_amd64.deb ...
Unpacking libtirpc-dev:amd64 (1.3.3-ok1) ...
Selecting previously unselected package libnsl2:amd64.
Preparing to unpack .../libnsl2_2.0.0-ok1_amd64.deb ...
Unpacking libnsl2:amd64 (2.0.0-ok1) ...
Setting up libnsl2:amd64 (2.0.0-ok1) ...
Selecting previously unselected package libnsl-dev:amd64.
(Reading database ... 12962 files and directories currently installed.)
Preparing to unpack .../libnsl-dev_2.0.0-ok1_amd64.deb ...
Unpacking libnsl-dev:amd64 (2.0.0-ok1) ...
Preparing to unpack .../linux-libc-dev_6.1.0-4.5ok1_amd64.deb ...
Unpacking linux-libc-dev:amd64 (6.1.0-4.5ok1) over (5.4.0-ok0) ...
Selecting previously unselected package gcc-12-base:amd64.
Preparing to unpack .../gcc-12-base_12.2.0-ok8_amd64.deb ...
Unpacking gcc-12-base:amd64 (12.2.0-ok8) ...
Setting up gcc-12-base:amd64 (12.2.0-ok8) ...
(Reading database ... 13038 files and directories currently installed.)
Preparing to unpack .../libgcc-s1_12.2.0-ok8_amd64.deb ...
Unpacking libgcc-s1:amd64 (12.2.0-ok8) over (10-20200411-ok5) ...
Setting up libgcc-s1:amd64 (12.2.0-ok8) ...
(Reading database ... 13038 files and directories currently installed.)
Preparing to unpack .../base-files_11-ok13.1_amd64.deb ...
Unpacking base-files (11-ok13.1) over (11-ok3) ...
Setting up base-files (11-ok13.1) ...
Installing new version of config file /etc/default/motd-news ...
Installing new version of config file /etc/issue ...
Installing new version of config file /etc/issue.net ...
Installing new version of config file /etc/lsb-release ...
Installing new version of config file /etc/update-motd.d/10-help-text ...
(Reading database ... 13038 files and directories currently installed.)
Preparing to unpack .../bash_5.0-ok4_amd64.deb ...
Unpacking bash (5.0-ok4) over (5.0-ok1) ...
Setting up bash (5.0-ok4) ...
update-alternatives: using /usr/share/man/man7/bash-builtins.7.gz to provide /usr/share/man/man7/builtins.7.gz (builtins.7.gz) in auto mode
(Reading database ... 13088 files and directories currently installed.)
Preparing to unpack .../bsdutils_1%3a2.38.1-ok5build1_amd64.deb ...
Unpacking bsdutils (1:2.38.1-ok5build1) over (1:2.34-ok1) ...
Setting up bsdutils (1:2.38.1-ok5build1) ...
(Reading database ... 13091 files and directories currently installed.)
Preparing to unpack .../libpcre2-8-0_10.34-ok2_amd64.deb ...
Unpacking libpcre2-8-0:amd64 (10.34-ok2) over (10.34-ok1) ...
Setting up libpcre2-8-0:amd64 (10.34-ok2) ...
(Reading database ... 13091 files and directories currently installed.)
Preparing to unpack .../libselinux1_3.4-ok2_amd64.deb ...
Unpacking libselinux1:amd64 (3.4-ok2) over (3.0-ok1) ...
Setting up libselinux1:amd64 (3.4-ok2) ...
(Reading database ... 13091 files and directories currently installed.)
Preparing to unpack .../coreutils_8.30-ok4_amd64.deb ...
Unpacking coreutils (8.30-ok4) over (8.30-ok1) ...
Setting up coreutils (8.30-ok4) ...
(Reading database ... 13144 files and directories currently installed.)
Preparing to unpack .../diffutils_1%3a3.7-ok2_amd64.deb ...
Unpacking diffutils (1:3.7-ok2) over (1:3.7-ok1) ...
Setting up diffutils (1:3.7-ok2) ...
(Reading database ... 13182 files and directories currently installed.)
Preparing to unpack .../libzstd1_1.5.2-ok2_amd64.deb ...
Unpacking libzstd1:amd64 (1.5.2-ok2) over (1.4.4+dfsg-ok1) ...
Setting up libzstd1:amd64 (1.5.2-ok2) ...
(Reading database ... 13182 files and directories currently installed.)
Preparing to unpack .../tar_1.30+dfsg-ok5_amd64.deb ...
Unpacking tar (1.30+dfsg-ok5) over (1.30+dfsg-ok1) ...
Setting up tar (1.30+dfsg-ok5) ...
(Reading database ... 13222 files and directories currently installed.)
Preparing to unpack .../dpkg_1.21.1-ok6.1_amd64.deb ...
Unpacking dpkg (1.21.1-ok6.1) over (1.21.1-ok1) ...
Setting up dpkg (1.21.1-ok6.1) ...
(Reading database ... 13222 files and directories currently installed.)
Preparing to unpack .../gzip_1.10-ok4_amd64.deb ...
Unpacking gzip (1.10-ok4) over (1.10-ok1) ...
Setting up gzip (1.10-ok4) ...
(Reading database ... 13222 files and directories currently installed.)
Preparing to unpack .../login_1%3a4.8.1-ok3.1_amd64.deb ...
Unpacking login (1:4.8.1-ok3.1) over (1:4.8.1-ok1) ...
Setting up login (1:4.8.1-ok3.1) ...
(Reading database ... 13262 files and directories currently installed.)
Preparing to unpack .../ncurses-bin_6.2-ok4_amd64.deb ...
Unpacking ncurses-bin (6.2-ok4) over (6.2-ok1) ...
Setting up ncurses-bin (6.2-ok4) ...
(Reading database ... 13262 files and directories currently installed.)
Preparing to unpack .../libperl5.30_5.30.0-ok6_amd64.deb ...
Unpacking libperl5.30:amd64 (5.30.0-ok6) over (5.30.0-ok2) ...
Preparing to unpack .../perl_5.30.0-ok6_amd64.deb ...
Unpacking perl (5.30.0-ok6) over (5.30.0-ok2) ...
Preparing to unpack .../perl-base_5.30.0-ok6_amd64.deb ...
Unpacking perl-base (5.30.0-ok6) over (5.30.0-ok2) ...
Setting up perl-base (5.30.0-ok6) ...
(Reading database ... 13278 files and directories currently installed.)
Preparing to unpack .../perl-modules-5.30_5.30.0-ok6_all.deb ...
Unpacking perl-modules-5.30 (5.30.0-ok6) over (5.30.0-ok2) ...
Preparing to unpack .../bzip2_1.0.8.2-0k0_amd64.deb ...
Unpacking bzip2 (1.0.8.2-0k0) over (1.0.8-ok1) ...
Preparing to unpack .../libbz2-1.0_1.0.8.2-0k0_amd64.deb ...
Unpacking libbz2-1.0:amd64 (1.0.8.2-0k0) over (1.0.8-ok1) ...
Setting up libbz2-1.0:amd64 (1.0.8.2-0k0) ...
(Reading database ... 13278 files and directories currently installed.)
Preparing to unpack .../zlib1g_1%3a1.2.11.dfsg-ok3_amd64.deb ...
Unpacking zlib1g:amd64 (1:1.2.11.dfsg-ok3) over (1:1.2.11.dfsg-ok1) ...
Setting up zlib1g:amd64 (1:1.2.11.dfsg-ok3) ...
(Reading database ... 13278 files and directories currently installed.)
Preparing to unpack .../libblkid1_2.38.1-ok5build1_amd64.deb ...
Unpacking libblkid1:amd64 (2.38.1-ok5build1) over (2.34-ok1) ...
Setting up libblkid1:amd64 (2.38.1-ok5build1) ...
(Reading database ... 13279 files and directories currently installed.)
Preparing to unpack .../libmount1_2.38.1-ok5build1_amd64.deb ...
Unpacking libmount1:amd64 (2.38.1-ok5build1) over (2.34-ok1) ...
Setting up libmount1:amd64 (2.38.1-ok5build1) ...
(Reading database ... 13280 files and directories currently installed.)
Preparing to unpack .../libsmartcols1_2.38.1-ok5build1_amd64.deb ...
Unpacking libsmartcols1:amd64 (2.38.1-ok5build1) over (2.34-ok1) ...
Setting up libsmartcols1:amd64 (2.38.1-ok5build1) ...
(Reading database ... 13281 files and directories currently installed.)
Preparing to unpack .../libaudit-common_1%3a2.8.5-ok3.1_all.deb ...
Unpacking libaudit-common (1:2.8.5-ok3.1) over (1:2.8.5-ok2) ...
Setting up libaudit-common (1:2.8.5-ok3.1) ...
(Reading database ... 13281 files and directories currently installed.)
Preparing to unpack .../libaudit1_1%3a2.8.5-ok3.1_amd64.deb ...
Unpacking libaudit1:amd64 (1:2.8.5-ok3.1) over (1:2.8.5-ok2) ...
Setting up libaudit1:amd64 (1:2.8.5-ok3.1) ...
(Reading database ... 13281 files and directories currently installed.)
Preparing to unpack .../libfdisk1_2.38.1-ok5build1_amd64.deb ...
Unpacking libfdisk1:amd64 (2.38.1-ok5build1) over (2.34-ok1) ...
Preparing to unpack .../fdisk_2.38.1-ok5build1_amd64.deb ...
Unpacking fdisk (2.38.1-ok5build1) over (2.34-ok1) ...
Preparing to unpack .../util-linux_2.38.1-ok5build1_amd64.deb ...
Unpacking util-linux (2.38.1-ok5build1) over (2.34-ok1) ...
Selecting previously unselected package util-linux-extra.
Preparing to unpack .../util-linux-extra_2.38.1-ok5build1_amd64.deb ...
Unpacking util-linux-extra (2.38.1-ok5build1) ...
Setting up util-linux-extra (2.38.1-ok5build1) ...
Installing new version of config file /etc/init.d/hwclock.sh ...
(Reading database ... 13294 files and directories currently installed.)
Preparing to unpack .../libuuid1_2.38.1-ok5build1_amd64.deb ...
Unpacking libuuid1:amd64 (2.38.1-ok5build1) over (2.34-ok1) ...
Setting up libuuid1:amd64 (2.38.1-ok5build1) ...
(Reading database ... 13294 files and directories currently installed.)
Preparing to unpack .../libncurses6_6.2-ok4_amd64.deb ...
Unpacking libncurses6:amd64 (6.2-ok4) over (6.2-ok1) ...
Preparing to unpack .../libncursesw6_6.2-ok4_amd64.deb ...
Unpacking libncursesw6:amd64 (6.2-ok4) over (6.2-ok1) ...
Preparing to unpack .../libtinfo6_6.2-ok4_amd64.deb ...
Unpacking libtinfo6:amd64 (6.2-ok4) over (6.2-ok1) ...
Setting up libtinfo6:amd64 (6.2-ok4) ...
(Reading database ... 13294 files and directories currently installed.)
Preparing to unpack .../readline-common_8.0-ok2_all.deb ...
Unpacking readline-common (8.0-ok2) over (8.0-ok1) ...
Preparing to unpack .../libreadline8_8.0-ok2_amd64.deb ...
Unpacking libreadline8:amd64 (8.0-ok2) over (8.0-ok1) ...
Preparing to unpack .../ncurses-base_6.2-ok4_all.deb ...
Unpacking ncurses-base (6.2-ok4) over (6.2-ok1) ...
Setting up ncurses-base (6.2-ok4) ...
(Reading database ... 13294 files and directories currently installed.)
Preparing to unpack .../sysvinit-utils_2.96-ok5_amd64.deb ...
Unpacking sysvinit-utils (2.96-ok5) over (2.96-ok3) ...
Setting up util-linux (2.38.1-ok5build1) ...
Installing new version of config file /etc/pam.d/su ...
Setting up sysvinit-utils (2.96-ok5) ...
Selecting previously unselected package libxxhash0:amd64.
(Reading database ... 13294 files and directories currently installed.)
Preparing to unpack .../libxxhash0_0.8.1-ok1_amd64.deb ...
Unpacking libxxhash0:amd64 (0.8.1-ok1) ...
Setting up libxxhash0:amd64 (0.8.1-ok1) ...
(Reading database ... 13299 files and directories currently installed.)
Preparing to unpack .../libgcrypt20_1.8.5-ok5_amd64.deb ...
Unpacking libgcrypt20:amd64 (1.8.5-ok5) over (1.8.5-ok1) ...
Setting up libgcrypt20:amd64 (1.8.5-ok5) ...
(Reading database ... 13299 files and directories currently installed.)
Preparing to unpack .../liblz4-1_1.9.2-ok3_amd64.deb ...
Unpacking liblz4-1:amd64 (1.9.2-ok3) over (1.9.2-ok1) ...
Setting up liblz4-1:amd64 (1.9.2-ok3) ...
(Reading database ... 13299 files and directories currently installed.)
Preparing to unpack .../liblzma5_5.2.4-ok6_amd64.deb ...
Unpacking liblzma5:amd64 (5.2.4-ok6) over (5.2.4-ok4) ...
Setting up liblzma5:amd64 (5.2.4-ok6) ...
(Reading database ... 13299 files and directories currently installed.)
Preparing to unpack .../libstdc++6_12.2.0-ok8_amd64.deb ...
Unpacking libstdc++6:amd64 (12.2.0-ok8) over (10-20200411-ok5) ...
Setting up libstdc++6:amd64 (12.2.0-ok8) ...
Selecting previously unselected package libssl3:amd64.
(Reading database ... 13299 files and directories currently installed.)
Preparing to unpack .../libssl3_3.0.8-ok4.1_amd64.deb ...
Unpacking libssl3:amd64 (3.0.8-ok4.1) ...
Preparing to unpack .../libip4tc2_1.8.4-ok2_amd64.deb ...
Unpacking libip4tc2:amd64 (1.8.4-ok2) over (1.8.4-ok1) ...
Preparing to unpack .../libkmod2_27-ok2.1_amd64.deb ...
Unpacking libkmod2:amd64 (27-ok2.1) over (27-ok1) ...
Preparing to unpack .../libpam0g_1.3.1-ok3_amd64.deb ...
Unpacking libpam0g:amd64 (1.3.1-ok3) over (1.3.1-ok1) ...
Setting up libpam0g:amd64 (1.3.1-ok3) ...
(Reading database ... 13310 files and directories currently installed.)
Preparing to unpack .../libseccomp2_2.5.3-ok2_amd64.deb ...
Unpacking libseccomp2:amd64 (2.5.3-ok2) over (2.4.3-ok1) ...
Setting up libseccomp2:amd64 (2.5.3-ok2) ...
Selecting previously unselected package libsystemd-shared:amd64.
(Reading database ... 13310 files and directories currently installed.)
Preparing to unpack .../libsystemd-shared_251.4-ok1.7_amd64.deb ...
Unpacking libsystemd-shared:amd64 (251.4-ok1.7) ...
Preparing to unpack .../systemd-sysv_251.4-ok1.7_amd64.deb ...
Unpacking systemd-sysv (251.4-ok1.7) over (245.4-ok1) ...
Selecting previously unselected package libsepol2:amd64.
Preparing to unpack .../libsepol2_3.4-ok2_amd64.deb ...
Unpacking libsepol2:amd64 (3.4-ok2) ...
Setting up libsepol2:amd64 (3.4-ok2) ...
(Reading database ... 13321 files and directories currently installed.)
Preparing to unpack .../libsemanage-common_3.0-ok2_all.deb ...
Unpacking libsemanage-common (3.0-ok2) over (3.0-ok1) ...
Setting up libsemanage-common (3.0-ok2) ...
(Reading database ... 13321 files and directories currently installed.)
Preparing to unpack .../libsemanage1_3.0-ok2_amd64.deb ...
Unpacking libsemanage1:amd64 (3.0-ok2) over (3.0-ok1) ...
Setting up libsemanage1:amd64 (3.0-ok2) ...
(Reading database ... 13321 files and directories currently installed.)
Preparing to unpack .../libpam-modules-bin_1.3.1-ok3_amd64.deb ...
Unpacking libpam-modules-bin (1.3.1-ok3) over (1.3.1-ok1) ...
Setting up libpam-modules-bin (1.3.1-ok3) ...
(Reading database ... 13321 files and directories currently installed.)
Preparing to unpack .../libpam-modules_1.3.1-ok3_amd64.deb ...
Unpacking libpam-modules:amd64 (1.3.1-ok3) over (1.3.1-ok1) ...
Setting up libpam-modules:amd64 (1.3.1-ok3) ...
(Reading database ... 13321 files and directories currently installed.)
Preparing to unpack .../passwd_1%3a4.8.1-ok3.1_amd64.deb ...
Unpacking passwd (1:4.8.1-ok3.1) over (1:4.8.1-ok1) ...
Setting up passwd (1:4.8.1-ok3.1) ...
(Reading database ... 13321 files and directories currently installed.)
Preparing to unpack .../adduser_3.118-ok4_all.deb ...
Unpacking adduser (3.118-ok4) over (3.118-ok1) ...
Setting up adduser (3.118-ok4) ...
(Reading database ... 13343 files and directories currently installed.)
Preparing to unpack .../systemd-timesyncd_251.4-ok1.7_amd64.deb ...
Unpacking systemd-timesyncd (251.4-ok1.7) over (245.4-ok1) ...
Preparing to unpack .../libudev1_251.4-ok1.7_amd64.deb ...
Unpacking libudev1:amd64 (251.4-ok1.7) over (245.4-ok1) ...
Setting up libudev1:amd64 (251.4-ok1.7) ...
(Reading database ... 13345 files and directories currently installed.)
Preparing to unpack .../libdevmapper1.02.1_2%3a1.02.167-ok3_amd64.deb ...
Unpacking libdevmapper1.02.1:amd64 (2:1.02.167-ok3) over (2:1.02.167-ok1) ...
Preparing to unpack .../libcryptsetup12_2%3a2.2.2-ok6_amd64.deb ...
Unpacking libcryptsetup12:amd64 (2:2.2.2-ok6) over (2:2.2.2-ok3) ...
Preparing to unpack .../mount_2.38.1-ok5build1_amd64.deb ...
Unpacking mount (2.38.1-ok5build1) over (2.34-ok1) ...
Setting up libssl3:amd64 (3.0.8-ok4.1) ...
(Reading database ... 13345 files and directories currently installed.)
Preparing to unpack .../systemd_251.4-ok1.7_amd64.deb ...
Unpacking systemd (251.4-ok1.7) over (245.4-ok1) ...
dpkg: warning: unable to delete old directory '/etc/dhcp/dhclient-enter-hooks.d': Directory not empty
Preparing to unpack .../libsystemd0_251.4-ok1.7_amd64.deb ...
Unpacking libsystemd0:amd64 (251.4-ok1.7) over (245.4-ok1) ...
Setting up libsystemd0:amd64 (251.4-ok1.7) ...
(Reading database ... 13419 files and directories currently installed.)
Preparing to unpack .../libapt-pkg6.0_2.5.4-ok6.2_amd64.deb ...
Unpacking libapt-pkg6.0:amd64 (2.5.4-ok6.2) over (2.0.2-ok4) ...
Setting up libapt-pkg6.0:amd64 (2.5.4-ok6.2) ...
Selecting previously unselected package openkylin-keyring.
(Reading database ... 13419 files and directories currently installed.)
Preparing to unpack .../openkylin-keyring_2022.05.12-ok1_all.deb ...
Unpacking openkylin-keyring (2022.05.12-ok1) ...
Setting up openkylin-keyring (2022.05.12-ok1) ...
(Reading database ... 13424 files and directories currently installed.)
Preparing to unpack .../libgmp10_2%3a6.2.0+dfsg-ok3_amd64.deb ...
Unpacking libgmp10:amd64 (2:6.2.0+dfsg-ok3) over (2:6.2.0+dfsg-ok1) ...
Setting up libgmp10:amd64 (2:6.2.0+dfsg-ok3) ...
(Reading database ... 13424 files and directories currently installed.)
Preparing to unpack .../libnettle7_3.5.1+really3.5.1-ok3_amd64.deb ...
Unpacking libnettle7:amd64 (3.5.1+really3.5.1-ok3) over (3.5.1+really3.5.1-ok1) ...
Setting up libnettle7:amd64 (3.5.1+really3.5.1-ok3) ...
(Reading database ... 13424 files and directories currently installed.)
Preparing to unpack .../libhogweed5_3.5.1+really3.5.1-ok3_amd64.deb ...
Unpacking libhogweed5:amd64 (3.5.1+really3.5.1-ok3) over (3.5.1+really3.5.1-ok1) ...
Setting up libhogweed5:amd64 (3.5.1+really3.5.1-ok3) ...
(Reading database ... 13424 files and directories currently installed.)
Preparing to unpack .../libunistring2_0.9.10-ok2_amd64.deb ...
Unpacking libunistring2:amd64 (0.9.10-ok2) over (0.9.10-ok1) ...
Setting up libunistring2:amd64 (0.9.10-ok2) ...
(Reading database ... 13424 files and directories currently installed.)
Preparing to unpack .../libidn2-0_2.2.0-ok2_amd64.deb ...
Unpacking libidn2-0:amd64 (2.2.0-ok2) over (2.2.0-ok1) ...
Setting up libidn2-0:amd64 (2.2.0-ok2) ...
Selecting previously unselected package libffi8:amd64.
(Reading database ... 13449 files and directories currently installed.)
Preparing to unpack .../libffi8_3.4.4-ok4_amd64.deb ...
Unpacking libffi8:amd64 (3.4.4-ok4) ...
Setting up libffi8:amd64 (3.4.4-ok4) ...
(Reading database ... 13454 files and directories currently installed.)
Preparing to unpack .../libp11-kit0_0.23.20-ok2_amd64.deb ...
Unpacking libp11-kit0:amd64 (0.23.20-ok2) over (0.23.20-ok1) ...
Setting up libp11-kit0:amd64 (0.23.20-ok2) ...
(Reading database ... 13454 files and directories currently installed.)
Preparing to unpack .../libtasn1-6_4.16.0-ok3_amd64.deb ...
Unpacking libtasn1-6:amd64 (4.16.0-ok3) over (4.16.0-ok1) ...
Setting up libtasn1-6:amd64 (4.16.0-ok3) ...
(Reading database ... 13454 files and directories currently installed.)
Preparing to unpack .../libgnutls30_3.6.13-ok12.1_amd64.deb ...
Unpacking libgnutls30:amd64 (3.6.13-ok12.1) over (3.6.13-ok2) ...
Setting up libgnutls30:amd64 (3.6.13-ok12.1) ...
(Reading database ... 13470 files and directories currently installed.)
Preparing to unpack .../apt_2.5.4-ok6.2_amd64.deb ...
Unpacking apt (2.5.4-ok6.2) over (2.0.2-ok4) ...
Setting up apt (2.5.4-ok6.2) ...
Installing new version of config file /etc/cron.daily/apt-compat ...
Removing obsolete conffile /etc/kernel/postinst.d/apt-auto-removal ...
(Reading database ... 13469 files and directories currently installed.)
Preparing to unpack .../libpam-runtime_1.3.1-ok3_all.deb ...
Unpacking libpam-runtime (1.3.1-ok3) over (1.3.1-ok1) ...
Setting up libpam-runtime (1.3.1-ok3) ...
(Reading database ... 13644 files and directories currently installed.)
Preparing to unpack .../libpcre3_2%3a8.39-ok5_amd64.deb ...
Unpacking libpcre3:amd64 (2:8.39-ok5) over (2:8.39-ok1) ...
Setting up libpcre3:amd64 (2:8.39-ok5) ...
(Reading database ... 13644 files and directories currently installed.)
Preparing to unpack .../ubuntu-keyring_2020.02.11.2-ok2_all.deb ...
Unpacking ubuntu-keyring (2020.02.11.2-ok2) over (2020.02.11.2-ok1) ...
Setting up ubuntu-keyring (2020.02.11.2-ok2) ...
Selecting previously unselected package libisl23:amd64.
(Reading database ... 13644 files and directories currently installed.)
Preparing to unpack .../00-libisl23_0.25-ok1_amd64.deb ...
Unpacking libisl23:amd64 (0.25-ok1) ...
Preparing to unpack .../01-g++-9_9.3.0-ok12_amd64.deb ...
Unpacking g++-9 (9.3.0-ok12) over (9.3.0-ok4) ...
Preparing to unpack .../02-gcc-9_9.3.0-ok12_amd64.deb ...
Unpacking gcc-9 (9.3.0-ok12) over (9.3.0-ok4) ...
Preparing to unpack .../03-cpp-9_9.3.0-ok12_amd64.deb ...
Unpacking cpp-9 (9.3.0-ok12) over (9.3.0-ok4) ...
Preparing to unpack .../04-libcc1-0_12.2.0-ok8_amd64.deb ...
Unpacking libcc1-0:amd64 (12.2.0-ok8) over (10-20200411-ok5) ...
Preparing to unpack .../05-libctf0_2.39.50.20221224-ok6_amd64.deb ...
Unpacking libctf0:amd64 (2.39.50.20221224-ok6) over (2.34-ok1) ...
Preparing to unpack .../06-binutils-x86-64-linux-gnu_2.39.50.20221224-ok6_amd64.deb ...
Unpacking binutils-x86-64-linux-gnu (2.39.50.20221224-ok6) over (2.34-ok1) ...
Preparing to unpack .../07-libbinutils_2.39.50.20221224-ok6_amd64.deb ...
Unpacking libbinutils:amd64 (2.39.50.20221224-ok6) over (2.34-ok1) ...
Preparing to unpack .../08-binutils_2.39.50.20221224-ok6_amd64.deb ...
Unpacking binutils (2.39.50.20221224-ok6) over (2.34-ok1) ...
Preparing to unpack .../09-binutils-common_2.39.50.20221224-ok6_amd64.deb ...
Unpacking binutils-common:amd64 (2.39.50.20221224-ok6) over (2.34-ok1) ...
Preparing to unpack .../10-libctf-nobfd0_2.39.50.20221224-ok6_amd64.deb ...
Unpacking libctf-nobfd0:amd64 (2.39.50.20221224-ok6) over (2.34-ok1) ...
Selecting previously unselected package libgprofng0:amd64.
Preparing to unpack .../11-libgprofng0_2.39.50.20221224-ok6_amd64.deb ...
Unpacking libgprofng0:amd64 (2.39.50.20221224-ok6) ...
Selecting previously unselected package libjansson4:amd64.
Preparing to unpack .../12-libjansson4_2.12-ok1_amd64.deb ...
Unpacking libjansson4:amd64 (2.12-ok1) ...
Preparing to unpack .../13-libgomp1_12.2.0-ok8_amd64.deb ...
Unpacking libgomp1:amd64 (12.2.0-ok8) over (10-20200411-ok5) ...
Preparing to unpack .../14-libitm1_12.2.0-ok8_amd64.deb ...
Unpacking libitm1:amd64 (12.2.0-ok8) over (10-20200411-ok5) ...
Preparing to unpack .../15-libatomic1_12.2.0-ok8_amd64.deb ...
Unpacking libatomic1:amd64 (12.2.0-ok8) over (10-20200411-ok5) ...
Preparing to unpack .../16-libasan5_9.3.0-ok12_amd64.deb ...
Unpacking libasan5:amd64 (9.3.0-ok12) over (9.3.0-ok4) ...
Preparing to unpack .../17-liblsan0_12.2.0-ok8_amd64.deb ...
Unpacking liblsan0:amd64 (12.2.0-ok8) over (10-20200411-ok5) ...
Preparing to unpack .../18-libubsan1_12.2.0-ok8_amd64.deb ...
Unpacking libubsan1:amd64 (12.2.0-ok8) over (10-20200411-ok5) ...
Preparing to unpack .../19-libquadmath0_12.2.0-ok8_amd64.deb ...
Unpacking libquadmath0:amd64 (12.2.0-ok8) over (10-20200411-ok5) ...
Preparing to unpack .../20-libstdc++-9-dev_9.3.0-ok12_amd64.deb ...
Unpacking libstdc++-9-dev:amd64 (9.3.0-ok12) over (9.3.0-ok4) ...
Preparing to unpack .../21-libgcc-9-dev_9.3.0-ok12_amd64.deb ...
Unpacking libgcc-9-dev:amd64 (9.3.0-ok12) over (9.3.0-ok4) ...
Preparing to unpack .../22-gcc-9-base_9.3.0-ok12_amd64.deb ...
Unpacking gcc-9-base:amd64 (9.3.0-ok12) over (9.3.0-ok4) ...
Preparing to unpack .../23-libprocps8_2%3a3.3.16-ok4.3_amd64.deb ...
Unpacking libprocps8:amd64 (2:3.3.16-ok4.3) over (2:3.3.16-ok1) ...
Preparing to unpack .../24-procps_2%3a3.3.16-ok4.3_amd64.deb ...
Unpacking procps (2:3.3.16-ok4.3) over (2:3.3.16-ok1) ...
Preparing to unpack .../25-liblockfile-bin_1.17-ok1_amd64.deb ...
Unpacking liblockfile-bin (1.17-ok1) over (1.16-ok0) ...
Preparing to unpack .../26-liblockfile1_1.17-ok1_amd64.deb ...
Unpacking liblockfile1:amd64 (1.17-ok1) over (1.16-ok0) ...
Preparing to unpack .../27-xz-utils_5.2.4-ok6_amd64.deb ...
Unpacking xz-utils (5.2.4-ok6) over (5.2.4-ok4) ...
Preparing to unpack .../28-advancecomp_2.5-ok1_amd64.deb ...
Unpacking advancecomp (2.5-ok1) over (2.1-ok0) ...
Preparing to unpack .../29-g++_4%3a9.3.0-ok7_amd64.deb ...
Unpacking g++ (4:9.3.0-ok7) over (4:9.3.0-ok3) ...
Preparing to unpack .../30-gcc_4%3a9.3.0-ok7_amd64.deb ...
Unpacking gcc (4:9.3.0-ok7) over (4:9.3.0-ok3) ...
Preparing to unpack .../31-cpp_4%3a9.3.0-ok7_amd64.deb ...
Unpacking cpp (4:9.3.0-ok7) over (4:9.3.0-ok3) ...
Preparing to unpack .../32-dpkg-dev_1.21.1-ok6.1_all.deb ...
Unpacking dpkg-dev (1.21.1-ok6.1) over (1.21.1-ok1) ...
Preparing to unpack .../33-libdpkg-perl_1.21.1-ok6.1_all.deb ...
Unpacking libdpkg-perl (1.21.1-ok6.1) over (1.21.1-ok1) ...
Preparing to unpack .../34-lto-disabled-list_24-ok19_all.deb ...
Unpacking lto-disabled-list (24-ok19) over (24-ok1) ...
Preparing to unpack .../35-build-essential_12.8-ok1_amd64.deb ...
Unpacking build-essential (12.8-ok1) over (12.8-ok0) ...
Preparing to unpack .../36-libsqlite3-0_3.39.4-ok4_amd64.deb ...
Unpacking libsqlite3-0:amd64 (3.39.4-ok4) over (3.31.1-ok1) ...
Preparing to unpack .../37-lockfile-progs_0.1.19-ok1_amd64.deb ...
Unpacking lockfile-progs (0.1.19-ok1) over (0.1.18) ...
Preparing to unpack .../38-openssl_3.0.8-ok4.1_amd64.deb ...
Unpacking openssl (3.0.8-ok4.1) over (1.1.1f-ok1) ...
Preparing to unpack .../39-pkgbinarymangler_150-ok1_all.deb ...
Unpacking pkgbinarymangler (150-ok1) over (149-ok2) ...
Setting up libip4tc2:amd64 (1.8.4-ok2) ...
Setting up lto-disabled-list (24-ok19) ...
Setting up liblockfile-bin (1.17-ok1) ...
Setting up perl-modules-5.30 (5.30.0-ok6) ...
Setting up libsqlite3-0:amd64 (3.39.4-ok4) ...
Setting up binutils-common:amd64 (2.39.50.20221224-ok6) ...
Setting up linux-libc-dev:amd64 (6.1.0-4.5ok1) ...
Setting up libctf-nobfd0:amd64 (2.39.50.20221224-ok6) ...
Setting up libgomp1:amd64 (12.2.0-ok8) ...
Setting up bzip2 (1.0.8.2-0k0) ...
Setting up libfakeroot:amd64 (1.30.1-ok2) ...
Setting up libjansson4:amd64 (2.12-ok1) ...
Setting up fakeroot (1.30.1-ok2) ...
Setting up libtirpc-dev:amd64 (1.3.3-ok1) ...
Setting up rpcsvc-proto (1.4.3-ok1) ...
Setting up libncurses6:amd64 (6.2-ok4) ...
Setting up xz-utils (5.2.4-ok6) ...
Setting up libquadmath0:amd64 (12.2.0-ok8) ...
Setting up libatomic1:amd64 (12.2.0-ok8) ...
Setting up libncursesw6:amd64 (6.2-ok4) ...
Setting up libfdisk1:amd64 (2.38.1-ok5build1) ...
Setting up libubsan1:amd64 (12.2.0-ok8) ...
Setting up advancecomp (2.5-ok1) ...
Setting up libdevmapper1.02.1:amd64 (2:1.02.167-ok3) ...
Setting up mount (2.38.1-ok5build1) ...
Setting up libnsl-dev:amd64 (2.0.0-ok1) ...
Setting up libperl5.30:amd64 (5.30.0-ok6) ...
Setting up libcryptsetup12:amd64 (2:2.2.2-ok6) ...
Setting up liblockfile1:amd64 (1.17-ok1) ...
Setting up libbinutils:amd64 (2.39.50.20221224-ok6) ...
Setting up libisl23:amd64 (0.25-ok1) ...
Setting up libc-dev-bin (2.36-ok6) ...
Setting up openssl (3.0.8-ok4.1) ...
Installing new version of config file /etc/ssl/openssl.cnf ...
Setting up readline-common (8.0-ok2) ...
Setting up libcc1-0:amd64 (12.2.0-ok8) ...
Setting up liblsan0:amd64 (12.2.0-ok8) ...
Setting up libprocps8:amd64 (2:3.3.16-ok4.3) ...
Setting up libitm1:amd64 (12.2.0-ok8) ...
Setting up libkmod2:amd64 (27-ok2.1) ...
Setting up gcc-9-base:amd64 (9.3.0-ok12) ...
Setting up libctf0:amd64 (2.39.50.20221224-ok6) ...
Setting up libreadline8:amd64 (8.0-ok2) ...
Setting up fdisk (2.38.1-ok5build1) ...
Setting up libasan5:amd64 (9.3.0-ok12) ...
Setting up perl (5.30.0-ok6) ...
Setting up libgprofng0:amd64 (2.39.50.20221224-ok6) ...
Setting up lockfile-progs (0.1.19-ok1) ...
Setting up libsystemd-shared:amd64 (251.4-ok1.7) ...
Setting up libdpkg-perl (1.21.1-ok6.1) ...
Setting up procps (2:3.3.16-ok4.3) ...
Setting up cpp-9 (9.3.0-ok12) ...
Setting up libc6-dev:amd64 (2.36-ok6) ...
Setting up binutils-x86-64-linux-gnu (2.39.50.20221224-ok6) ...
Setting up pkgbinarymangler (150-ok1) ...
Installing new version of config file /etc/pkgbinarymangler/maintainermangler.overrides ...
Installing new version of config file /etc/pkgbinarymangler/striptranslations.blacklist ...
Setting up systemd (251.4-ok1.7) ...
Installing new version of config file /etc/systemd/journald.conf ...
Installing new version of config file /etc/systemd/logind.conf ...
Installing new version of config file /etc/systemd/networkd.conf ...
Installing new version of config file /etc/systemd/pstore.conf ...
Installing new version of config file /etc/systemd/sleep.conf ...
Installing new version of config file /etc/systemd/system.conf ...
Installing new version of config file /etc/systemd/user.conf ...
Removing obsolete conffile /etc/dhcp/dhclient-enter-hooks.d/resolved ...
Removing obsolete conffile /etc/pam.d/systemd-user ...
Removing obsolete conffile /etc/systemd/resolved.conf ...
Setting up binutils (2.39.50.20221224-ok6) ...
Setting up dpkg-dev (1.21.1-ok6.1) ...
Setting up libgcc-9-dev:amd64 (9.3.0-ok12) ...
Setting up systemd-timesyncd (251.4-ok1.7) ...
Installing new version of config file /etc/dhcp/dhclient-exit-hooks.d/timesyncd ...
Installing new version of config file /etc/systemd/timesyncd.conf ...
Setting up cpp (4:9.3.0-ok7) ...
Setting up gcc-9 (9.3.0-ok12) ...
Setting up systemd-sysv (251.4-ok1.7) ...
Setting up libstdc++-9-dev:amd64 (9.3.0-ok12) ...
Setting up gcc (4:9.3.0-ok7) ...
Setting up g++-9 (9.3.0-ok12) ...
Setting up g++ (4:9.3.0-ok7) ...
update-alternatives: warning: forcing reinstallation of alternative /usr/bin/g++ because link group c++ is broken
Setting up build-essential (12.8-ok1) ...
Processing triggers for libc-bin (2.36-ok6) ...
RUN: /usr/share/launchpad-buildd/bin/sbuild-package PACKAGEBUILD-288501 amd64 yangtze -c chroot:build-PACKAGEBUILD-288501 --arch=amd64 --dist=yangtze --nolog -A libkylin-chkname_1.0.10kylin3uk1-0k2.dsc
Initiating build PACKAGEBUILD-288501 with 80 jobs across 80 processor cores.
Kernel reported to sbuild: 5.15.0-119-generic #129~20.04.1-Ubuntu SMP Wed Aug 7 13:07:13 UTC 2024 x86_64
sbuild (Debian sbuild) 0.79.0 (05 February 2020) on 1dbb9d95335a

+==============================================================================+
| libkylin-chkname 1.0.10kylin3uk1-0k2 (amd64) Tue, 18 Mar 2025 07:24:45 +0000 |
+==============================================================================+

Package: libkylin-chkname
Version: 1.0.10kylin3uk1-0k2
Source Version: 1.0.10kylin3uk1-0k2
Distribution: yangtze
Machine Architecture: amd64
Host Architecture: amd64
Build Architecture: amd64
Build Type: binary

I: NOTICE: Log filtering will replace 'home/buildd/build-PACKAGEBUILD-288501/chroot-autobuild' with '<<CHROOT>>'
I: NOTICE: Log filtering will replace 'build/libkylin-chkname-Dk89W5/resolver-FvvGCF' with '<<RESOLVERDIR>>'

+------------------------------------------------------------------------------+
| Fetch source files                                                           |
+------------------------------------------------------------------------------+


Local sources
-------------

libkylin-chkname_1.0.10kylin3uk1-0k2.dsc exists in .; copying to chroot
I: NOTICE: Log filtering will replace 'build/libkylin-chkname-Dk89W5/libkylin-chkname-1.0.10kylin3uk1' with '<<PKGBUILDDIR>>'
I: NOTICE: Log filtering will replace 'build/libkylin-chkname-Dk89W5' with '<<BUILDDIR>>'

+------------------------------------------------------------------------------+
| Install package build dependencies                                           |
+------------------------------------------------------------------------------+


Setup apt archive
-----------------

Merged Build-Depends: autotools-dev, debhelper-compat (= 12), build-essential, fakeroot
Filtered Build-Depends: autotools-dev, debhelper-compat (= 12), build-essential, fakeroot
dpkg-deb: building package 'sbuild-build-depends-main-dummy' in '/<<RESOLVERDIR>>/apt_archive/sbuild-build-depends-main-dummy.deb'.
Ign:1 copy:/<<RESOLVERDIR>>/apt_archive ./ InRelease
Get:2 copy:/<<RESOLVERDIR>>/apt_archive ./ Release [957 B]
Ign:3 copy:/<<RESOLVERDIR>>/apt_archive ./ Release.gpg
Get:4 copy:/<<RESOLVERDIR>>/apt_archive ./ Sources [376 B]
Get:5 copy:/<<RESOLVERDIR>>/apt_archive ./ Packages [461 B]
Fetched 1794 B in 0s (89.0 kB/s)
Reading package lists...
Reading package lists...

Install main build dependencies (apt-based resolver)
----------------------------------------------------

Installing build dependencies
Reading package lists...
Building dependency tree...
Reading state information...
The following packages were automatically installed and are no longer required:
  libffi7 libisl22 libsepol1 systemd-timesyncd
Use 'apt autoremove' to remove them.
The following additional packages will be installed:
  autoconf automake autopoint autotools-dev bsdextrautils bsdmainutils
  debhelper debugedit dh-autoreconf dh-strip-nondeterminism dwz file gettext
  gettext-base groff-base intltool-debian libarchive-zip-perl
  libdebhelper-perl libdw1 libelf1 libfile-stripnondeterminism-perl libicu66
  libmagic-mgc libmagic1 libpipeline1 libsigsegv2 libsub-override-perl libtool
  libuchardet0 libxml2 m4 man-db ncal po-debconf
Suggested packages:
  autoconf-archive gnu-standards autoconf-doc calendar whois vacation
  mailutils dh-make gettext-doc libasprintf-dev libgettextpo-dev groff
  libtool-doc gfortran | fortran95-compiler gcj-jdk m4-doc apparmor less
  www-browser libmail-box-perl
Recommended packages:
  curl | wget | lynx libarchive-cpio-perl libltdl-dev libmail-sendmail-perl
The following NEW packages will be installed:
  autoconf automake autopoint autotools-dev bsdextrautils bsdmainutils
  debhelper debugedit dh-autoreconf dh-strip-nondeterminism dwz file gettext
  gettext-base groff-base intltool-debian libarchive-zip-perl
  libdebhelper-perl libdw1 libelf1 libfile-stripnondeterminism-perl libicu66
  libmagic-mgc libmagic1 libpipeline1 libsigsegv2 libsub-override-perl libtool
  libuchardet0 libxml2 m4 man-db ncal po-debconf
  sbuild-build-depends-main-dummy
0 upgraded, 35 newly installed, 0 to remove and 0 not upgraded.
Need to get 18.4 MB of archives.
After this operation, 67.4 MB of additional disk space will be used.
Get:1 copy:/<<RESOLVERDIR>>/apt_archive ./ sbuild-build-depends-main-dummy 0.invalid.0 [684 B]
Get:2 http://archive.build.openkylin.top/openkylin yangtze/main amd64 bsdextrautils amd64 2.38.1-ok5build1 [79.1 kB]
Get:3 http://archive.build.openkylin.top/openkylin yangtze/main amd64 ncal amd64 12.1.7-ok1 [19.7 kB]
Get:4 http://archive.build.openkylin.top/openkylin yangtze/main amd64 bsdmainutils all 12.1.7-ok1 [5046 B]
Get:5 http://archive.build.openkylin.top/openkylin yangtze/main amd64 libuchardet0 amd64 0.0.6-ok1 [72.5 kB]
Get:6 http://archive.build.openkylin.top/openkylin yangtze/main amd64 groff-base amd64 1.22.4-ok3 [954 kB]
Get:7 http://archive.build.openkylin.top/openkylin yangtze/main amd64 libpipeline1 amd64 1.5.3-ok1 [38.6 kB]
Get:8 http://archive.build.openkylin.top/openkylin yangtze/main amd64 man-db amd64 2.9.1-ok3 [1320 kB]
Get:9 http://archive.build.openkylin.top/openkylin yangtze/main amd64 libmagic-mgc amd64 1:5.38-ok1 [217 kB]
Get:10 http://archive.build.openkylin.top/openkylin yangtze/main amd64 libmagic1 amd64 1:5.38-ok1 [75.8 kB]
Get:11 http://archive.build.openkylin.top/openkylin yangtze/main amd64 file amd64 1:5.38-ok1 [23.3 kB]
Get:12 http://archive.build.openkylin.top/openkylin yangtze/main amd64 gettext-base amd64 0.21-4-ok6 [88.8 kB]
Get:13 http://archive.build.openkylin.top/openkylin yangtze/main amd64 libsigsegv2 amd64 2.12-ok1 [12.5 kB]
Get:14 http://archive.build.openkylin.top/openkylin yangtze/main amd64 m4 amd64 1.4.18-ok3 [193 kB]
Get:15 http://archive.build.openkylin.top/openkylin yangtze/main amd64 autoconf all 2.71-ok2 [390 kB]
Get:16 http://archive.build.openkylin.top/openkylin yangtze/main amd64 autotools-dev all 20220506-ok1 [41.6 kB]
Get:17 http://archive.build.openkylin.top/openkylin yangtze/main amd64 automake all 1:1.16.5-ok1 [557 kB]
Get:18 http://archive.build.openkylin.top/openkylin yangtze/main amd64 autopoint all 0.21-4-ok6 [419 kB]
Get:19 http://archive.build.openkylin.top/openkylin yangtze/main amd64 libdebhelper-perl all 13.11.4-ok1 [63.6 kB]
Get:20 http://archive.build.openkylin.top/openkylin yangtze/main amd64 libtool all 2.4.7-ok3 [165 kB]
Get:21 http://archive.build.openkylin.top/openkylin yangtze/main amd64 dh-autoreconf all 20-ok1 [16.3 kB]
Get:22 http://archive.build.openkylin.top/openkylin yangtze/main amd64 libarchive-zip-perl all 1.68-ok1 [90.7 kB]
Get:23 http://archive.build.openkylin.top/openkylin yangtze/main amd64 libsub-override-perl all 0.09-ok2 [8374 B]
Get:24 http://archive.build.openkylin.top/openkylin yangtze/main amd64 libfile-stripnondeterminism-perl all 1.13.0-ok1 [16.8 kB]
Get:25 http://archive.build.openkylin.top/openkylin yangtze/main amd64 dh-strip-nondeterminism all 1.13.0-ok1 [5334 B]
Get:26 http://archive.build.openkylin.top/openkylin yangtze/main amd64 libelf1 amd64 0.187-ok1 [187 kB]
Get:27 http://archive.build.openkylin.top/openkylin yangtze/main amd64 libdw1 amd64 0.187-ok1 [255 kB]
Get:28 http://archive.build.openkylin.top/openkylin yangtze/main amd64 debugedit amd64 1:5.0-ok1 [66.9 kB]
Get:29 http://archive.build.openkylin.top/openkylin yangtze/main amd64 dwz amd64 0.15-1ok1 [113 kB]
Get:30 http://archive.build.openkylin.top/openkylin yangtze/main amd64 libicu66 amd64 66.1-ok4 [9806 kB]
Get:31 http://archive.build.openkylin.top/openkylin yangtze/main amd64 libxml2 amd64 2.9.10+dfsg-ok4 [687 kB]
Get:32 http://archive.build.openkylin.top/openkylin yangtze/main amd64 gettext amd64 0.21-4-ok6 [1217 kB]
Get:33 http://archive.build.openkylin.top/openkylin yangtze/main amd64 intltool-debian all 0.35.0+20060710.5-ok2 [23.2 kB]
Get:34 http://archive.build.openkylin.top/openkylin yangtze/main amd64 po-debconf all 1.0.21+nmu1-ok1 [227 kB]
Get:35 http://archive.build.openkylin.top/openkylin yangtze/main amd64 debhelper all 13.11.4-ok1 [924 kB]
debconf: delaying package configuration, since apt-utils is not installed
Fetched 18.4 MB in 2s (9807 kB/s)
Selecting previously unselected package bsdextrautils.
(Reading database ... 13921 files and directories currently installed.)
Preparing to unpack .../00-bsdextrautils_2.38.1-ok5build1_amd64.deb ...
Unpacking bsdextrautils (2.38.1-ok5build1) ...
Selecting previously unselected package ncal.
Preparing to unpack .../01-ncal_12.1.7-ok1_amd64.deb ...
Unpacking ncal (12.1.7-ok1) ...
Selecting previously unselected package bsdmainutils.
Preparing to unpack .../02-bsdmainutils_12.1.7-ok1_all.deb ...
Unpacking bsdmainutils (12.1.7-ok1) ...
Selecting previously unselected package libuchardet0:amd64.
Preparing to unpack .../03-libuchardet0_0.0.6-ok1_amd64.deb ...
Unpacking libuchardet0:amd64 (0.0.6-ok1) ...
Selecting previously unselected package groff-base.
Preparing to unpack .../04-groff-base_1.22.4-ok3_amd64.deb ...
Unpacking groff-base (1.22.4-ok3) ...
Selecting previously unselected package libpipeline1:amd64.
Preparing to unpack .../05-libpipeline1_1.5.3-ok1_amd64.deb ...
Unpacking libpipeline1:amd64 (1.5.3-ok1) ...
Selecting previously unselected package man-db.
Preparing to unpack .../06-man-db_2.9.1-ok3_amd64.deb ...
Unpacking man-db (2.9.1-ok3) ...
Selecting previously unselected package libmagic-mgc.
Preparing to unpack .../07-libmagic-mgc_1%3a5.38-ok1_amd64.deb ...
Unpacking libmagic-mgc (1:5.38-ok1) ...
Selecting previously unselected package libmagic1:amd64.
Preparing to unpack .../08-libmagic1_1%3a5.38-ok1_amd64.deb ...
Unpacking libmagic1:amd64 (1:5.38-ok1) ...
Selecting previously unselected package file.
Preparing to unpack .../09-file_1%3a5.38-ok1_amd64.deb ...
Unpacking file (1:5.38-ok1) ...
Selecting previously unselected package gettext-base.
Preparing to unpack .../10-gettext-base_0.21-4-ok6_amd64.deb ...
Unpacking gettext-base (0.21-4-ok6) ...
Selecting previously unselected package libsigsegv2:amd64.
Preparing to unpack .../11-libsigsegv2_2.12-ok1_amd64.deb ...
Unpacking libsigsegv2:amd64 (2.12-ok1) ...
Selecting previously unselected package m4.
Preparing to unpack .../12-m4_1.4.18-ok3_amd64.deb ...
Unpacking m4 (1.4.18-ok3) ...
Selecting previously unselected package autoconf.
Preparing to unpack .../13-autoconf_2.71-ok2_all.deb ...
Unpacking autoconf (2.71-ok2) ...
Selecting previously unselected package autotools-dev.
Preparing to unpack .../14-autotools-dev_20220506-ok1_all.deb ...
Unpacking autotools-dev (20220506-ok1) ...
Selecting previously unselected package automake.
Preparing to unpack .../15-automake_1%3a1.16.5-ok1_all.deb ...
Unpacking automake (1:1.16.5-ok1) ...
Selecting previously unselected package autopoint.
Preparing to unpack .../16-autopoint_0.21-4-ok6_all.deb ...
Unpacking autopoint (0.21-4-ok6) ...
Selecting previously unselected package libdebhelper-perl.
Preparing to unpack .../17-libdebhelper-perl_13.11.4-ok1_all.deb ...
Unpacking libdebhelper-perl (13.11.4-ok1) ...
Selecting previously unselected package libtool.
Preparing to unpack .../18-libtool_2.4.7-ok3_all.deb ...
Unpacking libtool (2.4.7-ok3) ...
Selecting previously unselected package dh-autoreconf.
Preparing to unpack .../19-dh-autoreconf_20-ok1_all.deb ...
Unpacking dh-autoreconf (20-ok1) ...
Selecting previously unselected package libarchive-zip-perl.
Preparing to unpack .../20-libarchive-zip-perl_1.68-ok1_all.deb ...
Unpacking libarchive-zip-perl (1.68-ok1) ...
Selecting previously unselected package libsub-override-perl.
Preparing to unpack .../21-libsub-override-perl_0.09-ok2_all.deb ...
Unpacking libsub-override-perl (0.09-ok2) ...
Selecting previously unselected package libfile-stripnondeterminism-perl.
Preparing to unpack .../22-libfile-stripnondeterminism-perl_1.13.0-ok1_all.deb ...
Unpacking libfile-stripnondeterminism-perl (1.13.0-ok1) ...
Selecting previously unselected package dh-strip-nondeterminism.
Preparing to unpack .../23-dh-strip-nondeterminism_1.13.0-ok1_all.deb ...
Unpacking dh-strip-nondeterminism (1.13.0-ok1) ...
Selecting previously unselected package libelf1:amd64.
Preparing to unpack .../24-libelf1_0.187-ok1_amd64.deb ...
Unpacking libelf1:amd64 (0.187-ok1) ...
Selecting previously unselected package libdw1:amd64.
Preparing to unpack .../25-libdw1_0.187-ok1_amd64.deb ...
Unpacking libdw1:amd64 (0.187-ok1) ...
Selecting previously unselected package debugedit.
Preparing to unpack .../26-debugedit_1%3a5.0-ok1_amd64.deb ...
Unpacking debugedit (1:5.0-ok1) ...
Selecting previously unselected package dwz.
Preparing to unpack .../27-dwz_0.15-1ok1_amd64.deb ...
Unpacking dwz (0.15-1ok1) ...
Selecting previously unselected package libicu66:amd64.
Preparing to unpack .../28-libicu66_66.1-ok4_amd64.deb ...
Unpacking libicu66:amd64 (66.1-ok4) ...
Selecting previously unselected package libxml2:amd64.
Preparing to unpack .../29-libxml2_2.9.10+dfsg-ok4_amd64.deb ...
Unpacking libxml2:amd64 (2.9.10+dfsg-ok4) ...
Selecting previously unselected package gettext.
Preparing to unpack .../30-gettext_0.21-4-ok6_amd64.deb ...
Unpacking gettext (0.21-4-ok6) ...
Selecting previously unselected package intltool-debian.
Preparing to unpack .../31-intltool-debian_0.35.0+20060710.5-ok2_all.deb ...
Unpacking intltool-debian (0.35.0+20060710.5-ok2) ...
Selecting previously unselected package po-debconf.
Preparing to unpack .../32-po-debconf_1.0.21+nmu1-ok1_all.deb ...
Unpacking po-debconf (1.0.21+nmu1-ok1) ...
Selecting previously unselected package debhelper.
Preparing to unpack .../33-debhelper_13.11.4-ok1_all.deb ...
Unpacking debhelper (13.11.4-ok1) ...
Selecting previously unselected package sbuild-build-depends-main-dummy.
Preparing to unpack .../34-sbuild-build-depends-main-dummy_0.invalid.0_amd64.deb ...
Unpacking sbuild-build-depends-main-dummy (0.invalid.0) ...
Setting up libpipeline1:amd64 (1.5.3-ok1) ...
Setting up bsdextrautils (2.38.1-ok5build1) ...
Setting up libmagic-mgc (1:5.38-ok1) ...
Setting up ncal (12.1.7-ok1) ...
Setting up libarchive-zip-perl (1.68-ok1) ...
Setting up libicu66:amd64 (66.1-ok4) ...
Setting up libdebhelper-perl (13.11.4-ok1) ...
Setting up libmagic1:amd64 (1:5.38-ok1) ...
Setting up gettext-base (0.21-4-ok6) ...
Setting up file (1:5.38-ok1) ...
Setting up autotools-dev (20220506-ok1) ...
Setting up libsigsegv2:amd64 (2.12-ok1) ...
Setting up bsdmainutils (12.1.7-ok1) ...
Setting up autopoint (0.21-4-ok6) ...
Setting up libuchardet0:amd64 (0.0.6-ok1) ...
Setting up libsub-override-perl (0.09-ok2) ...
Setting up libelf1:amd64 (0.187-ok1) ...
Setting up libxml2:amd64 (2.9.10+dfsg-ok4) ...
Setting up libfile-stripnondeterminism-perl (1.13.0-ok1) ...
Setting up libdw1:amd64 (0.187-ok1) ...
Setting up gettext (0.21-4-ok6) ...
Setting up libtool (2.4.7-ok3) ...
Setting up m4 (1.4.18-ok3) ...
Setting up intltool-debian (0.35.0+20060710.5-ok2) ...
Setting up autoconf (2.71-ok2) ...
Setting up dh-strip-nondeterminism (1.13.0-ok1) ...
Setting up dwz (0.15-1ok1) ...
Setting up groff-base (1.22.4-ok3) ...
Setting up debugedit (1:5.0-ok1) ...
Setting up automake (1:1.16.5-ok1) ...
update-alternatives: using /usr/bin/automake-1.16 to provide /usr/bin/automake (automake) in auto mode
Setting up po-debconf (1.0.21+nmu1-ok1) ...
Setting up man-db (2.9.1-ok3) ...
Not building database; man-db/auto-update is not 'true'.
Created symlink /etc/systemd/system/timers.target.wants/man-db.timer → /lib/systemd/system/man-db.timer.
Setting up dh-autoreconf (20-ok1) ...
Setting up debhelper (13.11.4-ok1) ...
Setting up sbuild-build-depends-main-dummy (0.invalid.0) ...
Processing triggers for libc-bin (2.36-ok6) ...

+------------------------------------------------------------------------------+
| Check architectures                                                          |
+------------------------------------------------------------------------------+

Arch check ok (amd64 included in any)

+------------------------------------------------------------------------------+
| Build environment                                                            |
+------------------------------------------------------------------------------+

Kernel: Linux 5.15.0-119-generic #129~20.04.1-Ubuntu SMP Wed Aug 7 13:07:13 UTC 2024 amd64 (x86_64)
Toolchain package versions: binutils_2.39.50.20221224-ok6 dpkg-dev_1.21.1-ok6.1 g++-9_9.3.0-ok12 gcc-9_9.3.0-ok12 libc6-dev_2.36-ok6 libstdc++-9-dev_9.3.0-ok12 libstdc++6_12.2.0-ok8 linux-libc-dev_6.1.0-4.5ok1
Package versions: adduser_3.118-ok4 advancecomp_2.5-ok1 apt_2.5.4-ok6.2 autoconf_2.71-ok2 automake_1:1.16.5-ok1 autopoint_0.21-4-ok6 autotools-dev_20220506-ok1 base-files_11-ok13.1 base-passwd_3.5.47-ok1 bash_5.0-ok4 binutils_2.39.50.20221224-ok6 binutils-common_2.39.50.20221224-ok6 binutils-x86-64-linux-gnu_2.39.50.20221224-ok6 bsdextrautils_2.38.1-ok5build1 bsdmainutils_12.1.7-ok1 bsdutils_1:2.38.1-ok5build1 build-essential_12.8-ok1 bzip2_1.0.8.2-0k0 ca-certificates_20190110-ok1 coreutils_8.30-ok4 cpp_4:9.3.0-ok7 cpp-9_9.3.0-ok12 dash_0.5.10.2-ok1 debconf_1.5.73-ok1 debhelper_13.11.4-ok1 debianutils_4.9.1-ok1 debugedit_1:5.0-ok1 dh-autoreconf_20-ok1 dh-strip-nondeterminism_1.13.0-ok1 diffutils_1:3.7-ok2 dpkg_1.21.1-ok6.1 dpkg-dev_1.21.1-ok6.1 dwz_0.15-1ok1 e2fsprogs_1.45.5-ok1 fakeroot_1.30.1-ok2 fdisk_2.38.1-ok5build1 file_1:5.38-ok1 findutils_4.7.0-ok1 g++_4:9.3.0-ok7 g++-9_9.3.0-ok12 gcc_4:9.3.0-ok7 gcc-10-base_10-20200411-ok5 gcc-12-base_12.2.0-ok8 gcc-9_9.3.0-ok12 gcc-9-base_9.3.0-ok12 gettext_0.21-4-ok6 gettext-base_0.21-4-ok6 gpg_2.2.19-ok1 gpg-agent_2.2.19-ok1 gpgconf_2.2.19-ok1 gpgv_2.2.19-ok1 grep_3.4-ok1 groff-base_1.22.4-ok3 gzip_1.10-ok4 hostname_3.23-ok2 init_1.57-ok2 init-system-helpers_1.57-ok2 intltool-debian_0.35.0+20060710.5-ok2 libacl1_2.2.53-ok1 libapparmor1_2.13.3-ok1 libapt-pkg6.0_2.5.4-ok6.2 libarchive-zip-perl_1.68-ok1 libargon2-1_0~20171227-ok1 libasan5_9.3.0-ok12 libassuan0_2.5.3-ok1 libatomic1_12.2.0-ok8 libattr1_1:2.4.48-ok1 libaudit-common_1:2.8.5-ok3.1 libaudit1_1:2.8.5-ok3.1 libbinutils_2.39.50.20221224-ok6 libblkid1_2.38.1-ok5build1 libbz2-1.0_1.0.8.2-0k0 libc-bin_2.36-ok6 libc-dev-bin_2.36-ok6 libc6_2.36-ok6 libc6-dev_2.36-ok6 libcap-ng0_0.7.9-ok1 libcap2_1:2.32-ok1 libcc1-0_12.2.0-ok8 libcom-err2_1.45.5-ok1 libcrypt-dev_1:4.4.10-ok1 libcrypt1_1:4.4.10-ok1 libcryptsetup12_2:2.2.2-ok6 libctf-nobfd0_2.39.50.20221224-ok6 libctf0_2.39.50.20221224-ok6 libdb5.3_5.3.28+dfsg1-ok1 libdebconfclient0_0.251-ok2 libdebhelper-perl_13.11.4-ok1 libdevmapper1.02.1_2:1.02.167-ok3 libdpkg-perl_1.21.1-ok6.1 libdw1_0.187-ok1 libelf1_0.187-ok1 libext2fs2_1.45.5-ok1 libfakeroot_1.30.1-ok2 libfdisk1_2.38.1-ok5build1 libffi7_3.3-ok1 libffi8_3.4.4-ok4 libfile-stripnondeterminism-perl_1.13.0-ok1 libgcc-9-dev_9.3.0-ok12 libgcc-s1_12.2.0-ok8 libgcrypt20_1.8.5-ok5 libgdbm-compat4_1.18.1-ok2 libgdbm6_1.18.1-ok2 libgmp10_2:6.2.0+dfsg-ok3 libgnutls30_3.6.13-ok12.1 libgomp1_12.2.0-ok8 libgpg-error0_1.37-ok1 libgprofng0_2.39.50.20221224-ok6 libgssapi-krb5-2_1.17-ok3 libhogweed5_3.5.1+really3.5.1-ok3 libicu66_66.1-ok4 libidn2-0_2.2.0-ok2 libip4tc2_1.8.4-ok2 libisl22_0.22.1-ok1 libisl23_0.25-ok1 libitm1_12.2.0-ok8 libjansson4_2.12-ok1 libjson-c4_0.13.1+dfsg-ok1 libk5crypto3_1.17-ok3 libkeyutils1_1.6-ok3 libkmod2_27-ok2.1 libkrb5-3_1.17-ok3 libkrb5support0_1.17-ok3 liblockfile-bin_1.17-ok1 liblockfile1_1.17-ok1 liblsan0_12.2.0-ok8 liblz4-1_1.9.2-ok3 liblzma5_5.2.4-ok6 libmagic-mgc_1:5.38-ok1 libmagic1_1:5.38-ok1 libmount1_2.38.1-ok5build1 libmpc3_1.1.0-ok1 libmpfr6_4.0.2-ok1 libncurses6_6.2-ok4 libncursesw6_6.2-ok4 libnettle7_3.5.1+really3.5.1-ok3 libnpth0_1.6-ok1 libnsl-dev_2.0.0-ok1 libnsl2_2.0.0-ok1 libp11-kit0_0.23.20-ok2 libpam-modules_1.3.1-ok3 libpam-modules-bin_1.3.1-ok3 libpam-runtime_1.3.1-ok3 libpam0g_1.3.1-ok3 libpcre2-8-0_10.34-ok2 libpcre3_2:8.39-ok5 libperl5.30_5.30.0-ok6 libpipeline1_1.5.3-ok1 libpng16-16_1.6.37-ok1 libprocps8_2:3.3.16-ok4.3 libquadmath0_12.2.0-ok8 libreadline8_8.0-ok2 libseccomp2_2.5.3-ok2 libselinux1_3.4-ok2 libsemanage-common_3.0-ok2 libsemanage1_3.0-ok2 libsepol1_3.0-ok1 libsepol2_3.4-ok2 libsigsegv2_2.12-ok1 libsmartcols1_2.38.1-ok5build1 libsqlite3-0_3.39.4-ok4 libss2_1.45.5-ok1 libssl1.1_1.1.1f-ok3 libssl3_3.0.8-ok4.1 libstdc++-9-dev_9.3.0-ok12 libstdc++6_12.2.0-ok8 libsub-override-perl_0.09-ok2 libsystemd-shared_251.4-ok1.7 libsystemd0_251.4-ok1.7 libtasn1-6_4.16.0-ok3 libtinfo6_6.2-ok4 libtirpc-common_1.3.3-ok1 libtirpc-dev_1.3.3-ok1 libtirpc3_1.3.3-ok1 libtool_2.4.7-ok3 libtsan0_10-20200411-ok5 libubsan1_12.2.0-ok8 libuchardet0_0.0.6-ok1 libudev1_251.4-ok1.7 libunistring2_0.9.10-ok2 libuuid1_2.38.1-ok5build1 libxml2_2.9.10+dfsg-ok4 libxxhash0_0.8.1-ok1 libzstd1_1.5.2-ok2 linux-libc-dev_6.1.0-4.5ok1 lockfile-progs_0.1.19-ok1 login_1:4.8.1-ok3.1 logsave_1.45.5-ok1 lsb-base_11.1.0-ok2 lto-disabled-list_24-ok19 m4_1.4.18-ok3 make_4.2.1-ok1 man-db_2.9.1-ok3 mawk_1.3.4.20200120-ok1 mount_2.38.1-ok5build1 ncal_12.1.7-ok1 ncurses-base_6.2-ok4 ncurses-bin_6.2-ok4 openkylin-keyring_2022.05.12-ok1 openssl_3.0.8-ok4.1 optipng_0.7.7-ok0 passwd_1:4.8.1-ok3.1 patch_2.7.6-ok1 perl_5.30.0-ok6 perl-base_5.30.0-ok6 perl-modules-5.30_5.30.0-ok6 pinentry-curses_1.1.0-ok1 pkgbinarymangler_150-ok1 po-debconf_1.0.21+nmu1-ok1 policyrcd-script-zg2_0.1-ok0 procps_2:3.3.16-ok4.3 readline-common_8.0-ok2 rpcsvc-proto_1.4.3-ok1 sbuild-build-depends-main-dummy_0.invalid.0 sed_4.7-ok1 sensible-utils_0.0.12+nmu1 systemd_251.4-ok1.7 systemd-sysv_251.4-ok1.7 systemd-timesyncd_251.4-ok1.7 sysvinit-utils_2.96-ok5 tar_1.30+dfsg-ok5 tzdata_2019c-ok1 ubuntu-keyring_2020.02.11.2-ok2 util-linux_2.38.1-ok5build1 util-linux-extra_2.38.1-ok5build1 xz-utils_5.2.4-ok6 zlib1g_1:1.2.11.dfsg-ok3

+------------------------------------------------------------------------------+
| Build                                                                        |
+------------------------------------------------------------------------------+


Unpack source
-------------

-----BEGIN PGP SIGNED MESSAGE-----
Hash: SHA512

Format: 3.0 (quilt)
Source: libkylin-chkname
Binary: libkylin-chkname-dev, libkylin-chkname1
Architecture: any
Version: 1.0.10kylin3uk1-0k2
Maintainer: mengy <mengyuan@kylinos.cn>
Homepage: <insert the upstream URL, if relevant>
Standards-Version: 4.4.1
Build-Depends: autotools-dev, debhelper-compat (= 12)
Package-List:
 libkylin-chkname-dev deb libdevel optional arch=any
 libkylin-chkname1 deb libs optional arch=any
Checksums-Sha1:
 0c69c19907c412c7f3117ddcdf1a849d3b055c64 340532 libkylin-chkname_1.0.10kylin3uk1.orig.tar.gz
 1d3de6eadf4cc98ff88ce423f1f02b7408c66f25 21308 libkylin-chkname_1.0.10kylin3uk1-0k2.debian.tar.xz
Checksums-Sha256:
 4061997ed03534b9c6deacc0d96efc37cfc4b92cbd62743b1e98fd5e520dfa88 340532 libkylin-chkname_1.0.10kylin3uk1.orig.tar.gz
 bb54edf03817e41f0d1c54be4eb6fcbb82495c09b0f9a8e73417671b275acf25 21308 libkylin-chkname_1.0.10kylin3uk1-0k2.debian.tar.xz
Files:
 728e699f8a2fe72ae46ba4d46f7a6acc 340532 libkylin-chkname_1.0.10kylin3uk1.orig.tar.gz
 ed040c28cfd0d27098c1c49027c715a0 21308 libkylin-chkname_1.0.10kylin3uk1-0k2.debian.tar.xz

-----BEGIN PGP SIGNATURE-----

iQGzBAEBCgAdFiEEZPu3n16uZNeS6Uz+BxbwD4Qs0nQFAmfZH7IACgkQBxbwD4Qs
0nTksQv/eKpAR2l2Snrhlh38g2iKLBBIidVJ/goJBJn24fnKPBWqYWLUAHnUKZAo
ETKneP3uPzWrtfc8VWGjRvIxQerBpVDCuUlijOj33Pg1CdJ1/QI2u+I4ZxPdyQfw
yJ3q9AIHHSgRV/nLAXcSBsVVYqdnIfX3iCLRX1JaFuylBBtBTOR5V+Ky2W9CIZoZ
0gJOmgYl3Q97+Xn6l79Kp6beW32xLRKVWcBFhNOikU58c5Y8GNbPdVZqyCHRIC39
tozxaCL5KMzmFuG/jpLJ4Y1QTYLq3F8CoHdqCkWr0nvPgtSMV3w6iM5NfOOtDjYP
4QWBXPW/QNcGkVuGeFzU9lFjqhY6nOm5uqULMM6bu86U0RGwQjCI0OqBlH63NnLA
pOqvgaqEHLSoifReMLd+p/KIE9iLikk+UVHpeDnjsMUMCMvzIoTs04ykZ+9nYTBv
4Bl4M5XkBCFc6xhHEww70MltNEC2/9MOgfMK8pPHQIDzMtWihtkU5CSueFOjYoeV
xtD95Hnz
=GMoP
-----END PGP SIGNATURE-----

gpgv: unknown type of key resource 'trustedkeys.kbx'
gpgv: keyblock resource '/tmp/dpkg-verify-sig.H6H9AVjI/trustedkeys.kbx': General error
gpgv: Signature made Tue Mar 18 07:24:34 2025 UTC
gpgv:                using RSA key 64FBB79F5EAE64D792E94CFE0716F00F842CD274
gpgv: Can't check signature: No public key
dpkg-source: warning: cannot verify signature ./libkylin-chkname_1.0.10kylin3uk1-0k2.dsc
dpkg-source: info: extracting libkylin-chkname in /<<PKGBUILDDIR>>
dpkg-source: info: unpacking libkylin-chkname_1.0.10kylin3uk1.orig.tar.gz
dpkg-source: info: unpacking libkylin-chkname_1.0.10kylin3uk1-0k2.debian.tar.xz
dpkg-source: info: using patch list from debian/patches/series
dpkg-source: info: applying 0001-update-version-to-1.0.10kylin3uk1-0k2.patch

Check disk space
----------------

Sufficient free space for build

User Environment
----------------

APT_CONFIG=/var/lib/sbuild/apt.conf
DEB_BUILD_OPTIONS=parallel=12
HOME=/sbuild-nonexistent
LC_ALL=C.UTF-8
LOGNAME=buildd
PATH=/usr/local/sbin:/usr/local/bin:/usr/sbin:/usr/bin:/sbin:/bin:/usr/games
SCHROOT_ALIAS_NAME=build-PACKAGEBUILD-288501
SCHROOT_CHROOT_NAME=build-PACKAGEBUILD-288501
SCHROOT_COMMAND=env
SCHROOT_GID=2501
SCHROOT_GROUP=buildd
SCHROOT_SESSION_ID=build-PACKAGEBUILD-288501
SCHROOT_UID=2001
SCHROOT_USER=buildd
SHELL=/bin/sh
USER=buildd

dpkg-buildpackage
-----------------

Command: dpkg-buildpackage -us -uc -mLaunchpad Build Daemon <buildd@1dbb9d95335a> -b -rfakeroot
dpkg-buildpackage: info: source package libkylin-chkname
dpkg-buildpackage: info: source version 1.0.10kylin3uk1-0k2
dpkg-buildpackage: info: source distribution nile
 dpkg-source --before-build .
dpkg-buildpackage: info: host architecture amd64
 fakeroot debian/rules clean
dh clean
   dh_clean
 debian/rules build
dh build
   dh_update_autotools_config
   dh_autoreconf
aclocal: warning: couldn't open directory 'm4': No such file or directory
libtoolize: putting auxiliary files in '.'.
libtoolize: copying file './ltmain.sh'
libtoolize: putting macros in 'm4'.
libtoolize: copying file 'm4/libtool.m4'
libtoolize: copying file 'm4/ltoptions.m4'
libtoolize: copying file 'm4/ltsugar.m4'
libtoolize: copying file 'm4/ltversion.m4'
libtoolize: copying file 'm4/lt~obsolete.m4'
libtoolize: Consider adding 'AC_CONFIG_MACRO_DIRS([m4])' to configure.ac,
libtoolize: and rerunning libtoolize and aclocal.
configure.ac:11: warning: The macro `AC_PROG_LIBTOOL' is obsolete.
configure.ac:11: You should run autoupdate.
m4/libtool.m4:100: AC_PROG_LIBTOOL is expanded from...
configure.ac:11: the top level
configure.ac:23: warning: AC_OUTPUT should be used without arguments.
configure.ac:23: You should run autoupdate.
configure.ac:10: installing './compile'
configure.ac:6: installing './missing'
Makefile.am: installing './depcomp'
   dh_auto_configure
	./configure --build=x86_64-linux-gnu --prefix=/usr --includedir=\${prefix}/include --mandir=\${prefix}/share/man --infodir=\${prefix}/share/info --sysconfdir=/etc --localstatedir=/var --disable-option-checking --disable-silent-rules --libdir=\${prefix}/lib/x86_64-linux-gnu --runstatedir=/run --disable-maintainer-mode --disable-dependency-tracking
checking for a BSD-compatible install... /usr/bin/install -c
checking whether build environment is sane... yes
checking for a race-free mkdir -p... /bin/mkdir -p
checking for gawk... no
checking for mawk... mawk
checking whether make sets $(MAKE)... yes
checking whether make supports nested variables... yes
checking for gcc... gcc
checking whether the C compiler works... yes
checking for C compiler default output file name... a.out
checking for suffix of executables... 
checking whether we are cross compiling... no
checking for suffix of object files... o
checking whether the compiler supports GNU C... yes
checking whether gcc accepts -g... yes
checking for gcc option to enable C11 features... none needed
checking whether gcc understands -c and -o together... yes
checking whether make supports the include directive... yes (GNU style)
checking dependency style of gcc... none
checking build system type... x86_64-pc-linux-gnu
checking host system type... x86_64-pc-linux-gnu
checking how to print strings... printf
checking for a sed that does not truncate output... /bin/sed
checking for grep that handles long lines and -e... /bin/grep
checking for egrep... /bin/grep -E
checking for fgrep... /bin/grep -F
checking for ld used by gcc... /usr/bin/ld
checking if the linker (/usr/bin/ld) is GNU ld... yes
checking for BSD- or MS-compatible name lister (nm)... /usr/bin/nm -B
checking the name lister (/usr/bin/nm -B) interface... BSD nm
checking whether ln -s works... yes
checking the maximum length of command line arguments... 1572864
checking how to convert x86_64-pc-linux-gnu file names to x86_64-pc-linux-gnu format... func_convert_file_noop
checking how to convert x86_64-pc-linux-gnu file names to toolchain format... func_convert_file_noop
checking for /usr/bin/ld option to reload object files... -r
checking for file... file
checking for objdump... objdump
checking how to recognize dependent libraries... pass_all
checking for dlltool... no
checking how to associate runtime and link libraries... printf %s\n
checking for ar... ar
checking for archiver @FILE support... @
checking for strip... strip
checking for ranlib... ranlib
checking command to parse /usr/bin/nm -B output from gcc object... ok
checking for sysroot... no
checking for a working dd... /bin/dd
checking how to truncate binary pipes... /bin/dd bs=4096 count=1
checking for mt... no
checking if : is a manifest tool... no
checking for stdio.h... yes
checking for stdlib.h... yes
checking for string.h... yes
checking for inttypes.h... yes
checking for stdint.h... yes
checking for strings.h... yes
checking for sys/stat.h... yes
checking for sys/types.h... yes
checking for unistd.h... yes
checking for dlfcn.h... yes
checking for objdir... .libs
checking if gcc supports -fno-rtti -fno-exceptions... no
checking for gcc option to produce PIC... -fPIC -DPIC
checking if gcc PIC flag -fPIC -DPIC works... yes
checking if gcc static flag -static works... yes
checking if gcc supports -c -o file.o... yes
checking if gcc supports -c -o file.o... (cached) yes
checking whether the gcc linker (/usr/bin/ld -m elf_x86_64) supports shared libraries... yes
checking whether -lc should be explicitly linked in... no
checking dynamic linker characteristics... GNU/Linux ld.so
checking how to hardcode library paths into programs... immediate
checking whether stripping libraries is possible... yes
checking if libtool supports shared libraries... yes
checking whether to build shared libraries... yes
checking whether to build static libraries... yes
checking for libintl.h... yes
checking for string.h... (cached) yes
checking for syslog.h... yes
checking for strerror... yes
checking that generated files are newer than configure... done
configure: creating ./config.status
config.status: creating Makefile
config.status: creating po/Makefile.in
config.status: creating config.h
config.status: executing depfiles commands
config.status: executing libtool commands
   dh_auto_build
	make -j12
make[1]: Entering directory '/<<PKGBUILDDIR>>'
make  all-recursive
make[2]: Entering directory '/<<PKGBUILDDIR>>'
Making all in po
make[3]: Entering directory '/<<PKGBUILDDIR>>/po'
make[3]: *** No rule to make target 'all'.  Stop.
make[3]: Leaving directory '/<<PKGBUILDDIR>>/po'
make[2]: *** [Makefile:558: all-recursive] Error 1
make[2]: Leaving directory '/<<PKGBUILDDIR>>'
make[1]: *** [Makefile:395: all] Error 2
make[1]: Leaving directory '/<<PKGBUILDDIR>>'
dh_auto_build: error: make -j12 returned exit code 2
make: *** [debian/rules:18: build] Error 25
dpkg-buildpackage: error: debian/rules build subprocess returned exit status 2
--------------------------------------------------------------------------------
Build finished at 2025-03-18T07:25:03Z

Finished
--------


+------------------------------------------------------------------------------+
| Cleanup                                                                      |
+------------------------------------------------------------------------------+

Purging /<<BUILDDIR>>
Not removing build depends: as requested
E: Build failure (dpkg-buildpackage died)

+------------------------------------------------------------------------------+
| Summary                                                                      |
+------------------------------------------------------------------------------+

Build Architecture: amd64
Build Type: binary
Build-Space: 4868
Build-Time: 9
Distribution: yangtze
Fail-Stage: build
Host Architecture: amd64
Install-Time: 8
Job: libkylin-chkname_1.0.10kylin3uk1-0k2.dsc
Machine Architecture: amd64
Package: libkylin-chkname
Package-Time: 18
Source-Version: 1.0.10kylin3uk1-0k2
Space: 4868
Status: attempted
Version: 1.0.10kylin3uk1-0k2
--------------------------------------------------------------------------------
Finished at 2025-03-18T07:25:03Z
Build needed 00:00:18, 4868k disk space
E: Build failure (dpkg-buildpackage died)
Adding user buildd to group lxd
RUN: /usr/share/launchpad-buildd/bin/in-target scan-for-processes --backend=chroot --series=yangtze --arch=amd64 PACKAGEBUILD-288501
Scanning for processes to kill in build PACKAGEBUILD-288501
RUN: /usr/share/launchpad-buildd/bin/in-target umount-chroot --backend=chroot --series=yangtze --arch=amd64 PACKAGEBUILD-288501
Stopping target for build PACKAGEBUILD-288501
RUN: /usr/share/launchpad-buildd/bin/in-target remove-build --backend=chroot --series=yangtze --arch=amd64 PACKAGEBUILD-288501
Removing build PACKAGEBUILD-288501