https://build.openkylin.top/~cibot/+archive/openkylin/jenkins-ci-open-mr-8659/+build/288505
RUN: /usr/share/launchpad-buildd/bin/builder-prep 
Kernel version: Linux 02a0ff1f52c3 5.15.0-88-generic #98-Ubuntu SMP Mon Oct 2 15:18:56 UTC 2023 riscv64
Buildd toolchain package versions: launchpad-buildd_203~505~kylin18.04.1k4 python-lpbuildd_203~505~kylin18.04.1k4 python3-lpbuildd_203~505~kylin18.04.1k4 sbuild_0.67.0-2kord7 git_1:2.25.1-1ubuntu3.2 dpkg-dev_1.19.7ubuntu3 python-debian_0.1.36ubuntu1 python3-debian_0.1.36ubuntu1.
RUN: /usr/share/launchpad-buildd/bin/in-target unpack-chroot --backend=chroot --series=yangtze --arch=rv64g PACKAGEBUILD-288505 --image-type chroot /home/buildd/filecache-default/259c4bfd0149bd171298258a9f2bb92579e99e49
Creating target for build PACKAGEBUILD-288505
RUN: /usr/share/launchpad-buildd/bin/in-target mount-chroot --backend=chroot --series=yangtze --arch=rv64g PACKAGEBUILD-288505
Starting target for build PACKAGEBUILD-288505
RUN: /usr/share/launchpad-buildd/bin/in-target override-sources-list --backend=chroot --series=yangtze --arch=rv64g PACKAGEBUILD-288505 'deb http://archive.build.openkylin.top/openkylin yangtze main' 'deb http://archive.build.openkylin.top/openkylin yangtze-security main' 'deb http://archive.build.openkylin.top/openkylin yangtze-updates main' 'deb http://archive.build.openkylin.top/openkylin yangtze-proposed main'
Can't find dpkg-alter package
Overriding sources.list in build-PACKAGEBUILD-288505
RUN: /usr/share/launchpad-buildd/bin/in-target add-trusted-keys --backend=chroot --series=yangtze --arch=rv64g PACKAGEBUILD-288505
Adding trusted keys to build-PACKAGEBUILD-288505
Warning: apt-key is deprecated. Manage keyring files in trusted.gpg.d instead (see apt-key(8)).
OK
Warning: apt-key is deprecated. Manage keyring files in trusted.gpg.d instead (see apt-key(8)).
/etc/apt/trusted.gpg.d/openkylin-archive-keyring.gpg
----------------------------------------------------
pub   rsa4096 2022-05-12 [SC] [expires: 2032-05-09]
      09FF C10E A273 DD29 A986  B110 8B31 3CEA FF59 2D96
uid           [ unknown] openKylin Archive Signing Key <release-team@openkylin.top>
sub   rsa4096 2022-05-12 [E] [expires: 2032-05-09]

/etc/apt/trusted.gpg.d/ubuntu-keyring-2012-archive.gpg
------------------------------------------------------
pub   rsa4096 2012-05-11 [SC]
      790B C727 7767 219C 42C8  6F93 3B4F E6AC C0B2 1F32
uid           [ unknown] Ubuntu Archive Automatic Signing Key (2012) <ftpmaster@ubuntu.com>

/etc/apt/trusted.gpg.d/ubuntu-keyring-2012-cdimage.gpg
------------------------------------------------------
pub   rsa4096 2012-05-11 [SC]
      8439 38DF 228D 22F7 B374  2BC0 D94A A3F0 EFE2 1092
uid           [ unknown] Ubuntu CD Image Automatic Signing Key (2012) <cdimage@ubuntu.com>

/etc/apt/trusted.gpg.d/ubuntu-keyring-2018-archive.gpg
------------------------------------------------------
pub   rsa4096 2018-09-17 [SC]
      F6EC B376 2474 EDA9 D21B  7022 8719 20D1 991B C93C
uid           [ unknown] Ubuntu Archive Automatic Signing Key (2018) <ftpmaster@ubuntu.com>

RUN: /usr/share/launchpad-buildd/bin/in-target update-debian-chroot --backend=chroot --series=yangtze --arch=rv64g PACKAGEBUILD-288505
Updating target for build PACKAGEBUILD-288505
Get:1 http://archive.build.openkylin.top/openkylin yangtze InRelease [36.9 kB]
Get:2 http://archive.build.openkylin.top/openkylin yangtze-security InRelease [36.9 kB]
Get:3 http://archive.build.openkylin.top/openkylin yangtze-updates InRelease [36.9 kB]
Get:4 http://archive.build.openkylin.top/openkylin yangtze-proposed InRelease [77.6 kB]
Get:5 http://archive.build.openkylin.top/OTHER/Internal-mirror/rv64g-stage0 yangtze InRelease [3916 B]
Hit:6 http://archive.build.openkylin.top/OTHER/Internal-mirror/repack5/baseok0.fix yangtze InRelease
Get:7 http://archive.build.openkylin.top/OTHER/Internal-mirror/stage0 yangtze InRelease [8361 B]
Get:8 http://archive.build.openkylin.top/openkylin yangtze/main rv64g Packages [1924 kB]
Get:9 http://archive.build.openkylin.top/openkylin yangtze/main riscv64 Packages [2313 kB]
Get:10 http://archive.build.openkylin.top/openkylin yangtze-proposed/main rv64g Packages [766 kB]
Get:11 http://archive.build.openkylin.top/openkylin yangtze-proposed/main riscv64 Packages [1554 kB]
Get:12 http://archive.build.openkylin.top/openkylin yangtze-proposed/main Translation-en [452 kB]
Get:13 http://archive.build.openkylin.top/OTHER/Internal-mirror/rv64g-stage0 yangtze/main rv64g Packages [2242 kB]
Get:14 http://archive.build.openkylin.top/OTHER/Internal-mirror/stage0 yangtze/main rv64g Packages [2400 kB]
Get:15 http://archive.build.openkylin.top/OTHER/Internal-mirror/stage0 yangtze/main riscv64 Packages [173 kB]
Fetched 12.0 MB in 1min 3s (191 kB/s)
Reading package lists...
Reading package lists...
Building dependency tree...
Reading state information...
Calculating upgrade...
The following packages will be REMOVED:
  apt-dbgsym* apt-utils-dbgsym* dpkg-dbgsym* dselect-dbgsym*
  libapt-pkg6.0-dbgsym* nscd-dbgsym*
The following packages will be upgraded:
  apt apt-utils base-files bash bsdutils coreutils dbus dbus-bin dbus-daemon
  dbus-session-bus-common dbus-system-bus-common diffutils dpkg dpkg-dev
  dselect grep gzip java-common libapt-pkg-dev libapt-pkg6.0 libasan8
  libatomic1 libaudit-common libaudit1 libc-bin libc-dev-bin libc-devtools
  libc6 libc6-dev libc6-prof libcc1-0 libcrypt-dev libcrypt1 libcryptsetup12
  libcups2 libdb5.3 libdbus-1-3 libdevmapper1.02.1 libdpkg-dev libdpkg-perl
  libexpat1 libffi8 libfontconfig1 libgcc-12-dev libgcc-s1 libgfortran5
  libgmp-dev libgmpxx4ldbl libgnutls30 libgomp1 libgssapi-krb5-2 libjbig0
  libjpeg-turbo8 libjpeg62-turbo libk5crypto3 libkeyutils1 libkrb5-3
  libkrb5support0 liblocale-gettext-perl liblz4-1 liblzma-dev liblzma5
  libmount1 libncursesw6 libnss3 libobjc4 libp11-kit0 libpcre2-8-0 libpcre3
  libpcsclite1 libperl5.30 libreadline8 libseccomp2 libsqlite3-0 libssl3
  libsystemd-shared libsystemd0 libtext-iconv-perl libtiff5 libtinfo6 libudev1
  libwebp7 libxcb1 libxi6 locales-all login mount ncurses-base ncurses-bin
  nscd openssl passwd perl perl-base perl-modules-5.30 pkgbinarymangler
  readline-common systemd systemd-sysv systemd-timesyncd tar tzdata util-linux
  xz-utils zlib1g-dev
105 upgraded, 0 newly installed, 6 to remove and 0 not upgraded.
Need to get 62.6 MB of archives.
After this operation, 22.0 MB disk space will be freed.
Get:1 http://archive.build.openkylin.top/openkylin yangtze/main rv64g libcrypt-dev rv64g 1:4.4.10-ok3.1 [276 kB]
Get:2 http://archive.build.openkylin.top/openkylin yangtze/main rv64g libc-devtools rv64g 2.36-ok6 [27.4 kB]
Get:3 http://archive.build.openkylin.top/openkylin yangtze/main rv64g libc6-dev rv64g 2.36-ok6 [3032 kB]
Get:4 http://archive.build.openkylin.top/openkylin yangtze/main rv64g libc-dev-bin rv64g 2.36-ok6 [19.0 kB]
Get:5 http://archive.build.openkylin.top/openkylin yangtze/main rv64g libc6-prof rv64g 2.36-ok6 [1078 kB]
Get:6 http://archive.build.openkylin.top/OTHER/Internal-mirror/rv64g-stage0 yangtze/main rv64g libgcc-s1 rv64g 12.2.0-ok7 [45.5 kB]
Get:7 http://archive.build.openkylin.top/openkylin yangtze/main rv64g libcrypt1 rv64g 1:4.4.10-ok3.1 [116 kB]
Get:8 http://archive.build.openkylin.top/openkylin yangtze/main rv64g libc6 rv64g 2.36-ok6 [2559 kB]
Get:9 http://archive.build.openkylin.top/openkylin yangtze/main rv64g base-files rv64g 11-ok13.1 [59.4 kB]
Get:10 http://archive.build.openkylin.top/openkylin yangtze/main rv64g bash rv64g 5.0-ok4 [1253 kB]
Get:11 http://archive.build.openkylin.top/openkylin yangtze/main rv64g bsdutils rv64g 1:2.38.1-ok5build1 [89.0 kB]
Get:12 http://archive.build.openkylin.top/openkylin yangtze/main rv64g coreutils rv64g 8.30-ok4 [2621 kB]
Get:13 http://archive.build.openkylin.top/openkylin yangtze/main rv64g diffutils rv64g 1:3.7-ok2 [354 kB]
Get:14 http://archive.build.openkylin.top/openkylin yangtze/main rv64g libapt-pkg-dev rv64g 2.5.4-ok6.2 [99.4 kB]
Get:15 http://archive.build.openkylin.top/openkylin yangtze/main rv64g liblz4-1 rv64g 1.9.2-ok3 [78.4 kB]
Get:16 http://archive.build.openkylin.top/openkylin yangtze/main rv64g liblzma-dev rv64g 5.2.4-ok6 [220 kB]
Get:17 http://archive.build.openkylin.top/openkylin yangtze/main rv64g liblzma5 rv64g 5.2.4-ok6 [135 kB]
Get:18 http://archive.build.openkylin.top/openkylin yangtze/main rv64g systemd-timesyncd rv64g 251.4-ok1.7 [31.5 kB]
Get:19 http://archive.build.openkylin.top/openkylin yangtze/main rv64g libaudit-common all 1:2.8.5-ok3.1 [3096 B]
Get:20 http://archive.build.openkylin.top/openkylin yangtze/main rv64g libaudit1 rv64g 1:2.8.5-ok3.1 [41.3 kB]
Get:21 http://archive.build.openkylin.top/openkylin yangtze/main rv64g libmount1 rv64g 2.38.1-ok5build1 [147 kB]
Get:22 http://archive.build.openkylin.top/openkylin yangtze/main rv64g libssl3 rv64g 3.0.8-ok4.1 [1461 kB]
Get:23 http://archive.build.openkylin.top/openkylin yangtze/main rv64g systemd-sysv rv64g 251.4-ok1.7 [11.1 kB]
Get:24 http://archive.build.openkylin.top/openkylin yangtze/main rv64g systemd rv64g 251.4-ok1.7 [2701 kB]
Get:25 http://archive.build.openkylin.top/openkylin yangtze/main rv64g libsystemd-shared rv64g 251.4-ok1.7 [1511 kB]
Get:26 http://archive.build.openkylin.top/openkylin yangtze/main rv64g libudev1 rv64g 251.4-ok1.7 [81.2 kB]
Get:27 http://archive.build.openkylin.top/openkylin yangtze/main rv64g libdevmapper1.02.1 rv64g 2:1.02.167-ok3 [129 kB]
Get:28 http://archive.build.openkylin.top/openkylin yangtze/main rv64g libcryptsetup12 rv64g 2:2.2.2-ok6 [171 kB]
Get:29 http://archive.build.openkylin.top/openkylin yangtze/main rv64g mount rv64g 2.38.1-ok5build1 [131 kB]
Get:30 http://archive.build.openkylin.top/openkylin yangtze/main rv64g libsystemd0 rv64g 251.4-ok1.7 [303 kB]
Get:31 http://archive.build.openkylin.top/openkylin yangtze/main rv64g libapt-pkg6.0 rv64g 2.5.4-ok6.2 [932 kB]
Get:32 http://archive.build.openkylin.top/openkylin yangtze/main rv64g tar rv64g 1.30+dfsg-ok5 [779 kB]
Get:33 http://archive.build.openkylin.top/OTHER/Internal-mirror/rv64g-stage0 yangtze/main rv64g dpkg rv64g 1.21.1-ok6.6 [1166 kB]
Get:34 http://archive.build.openkylin.top/openkylin yangtze/main rv64g grep rv64g 3.4-ok3 [239 kB]
Get:35 http://archive.build.openkylin.top/openkylin yangtze-proposed/main rv64g gzip rv64g 1.10-ok4 [92.5 kB]
Get:36 http://archive.build.openkylin.top/openkylin yangtze/main rv64g login rv64g 1:4.8.1-ok3.1 [451 kB]
Get:37 http://archive.build.openkylin.top/openkylin yangtze/main rv64g ncurses-bin rv64g 6.2-ok4 [175 kB]
Get:38 http://archive.build.openkylin.top/openkylin yangtze/main rv64g libperl5.30 rv64g 5.30.0-ok6 [3976 kB]
Get:39 http://archive.build.openkylin.top/openkylin yangtze/main rv64g perl rv64g 5.30.0-ok6 [226 kB]
Get:40 http://archive.build.openkylin.top/openkylin yangtze/main rv64g perl-base rv64g 5.30.0-ok6 [1558 kB]
Get:41 http://archive.build.openkylin.top/openkylin yangtze/main rv64g perl-modules-5.30 all 5.30.0-ok6 [2901 kB]
Get:42 http://archive.build.openkylin.top/openkylin yangtze/main rv64g libdb5.3 rv64g 5.3.28+dfsg1-ok1 [683 kB]
Get:43 http://archive.build.openkylin.top/openkylin yangtze/main rv64g util-linux rv64g 2.38.1-ok5build1 [1179 kB]
Get:44 http://archive.build.openkylin.top/openkylin yangtze/main rv64g libc-bin rv64g 2.36-ok6 [557 kB]
Get:45 http://archive.build.openkylin.top/openkylin yangtze/main rv64g ncurses-base all 6.2-ok4 [18.1 kB]
Get:46 http://archive.build.openkylin.top/openkylin yangtze/main rv64g apt rv64g 2.5.4-ok6.2 [1335 kB]
Get:47 http://archive.build.openkylin.top/openkylin yangtze/main rv64g apt-utils rv64g 2.5.4-ok6.2 [297 kB]
Get:48 http://archive.build.openkylin.top/openkylin yangtze/main rv64g libffi8 rv64g 3.4.4-ok4 [20.8 kB]
Get:49 http://archive.build.openkylin.top/openkylin yangtze/main rv64g libp11-kit0 rv64g 0.23.20-ok2 [190 kB]
Get:50 http://archive.build.openkylin.top/openkylin yangtze/main rv64g libgnutls30 rv64g 3.6.13-ok12.1 [866 kB]
Get:51 http://archive.build.openkylin.top/openkylin yangtze/main rv64g liblocale-gettext-perl rv64g 1.07-ok1 [14.8 kB]
Get:52 http://archive.build.openkylin.top/openkylin yangtze/main rv64g dbus-bin rv64g 1.14.6-ok2 [37.0 kB]
Get:53 http://archive.build.openkylin.top/openkylin yangtze/main rv64g dbus-system-bus-common all 1.14.6-ok2 [72.3 kB]
Get:54 http://archive.build.openkylin.top/openkylin yangtze/main rv64g dbus-session-bus-common all 1.14.6-ok2 [71.3 kB]
Get:55 http://archive.build.openkylin.top/openkylin yangtze/main rv64g dbus rv64g 1.14.6-ok2 [28.2 kB]
Get:56 http://archive.build.openkylin.top/openkylin yangtze/main rv64g dbus-daemon rv64g 1.14.6-ok2 [110 kB]
Get:57 http://archive.build.openkylin.top/openkylin yangtze/main rv64g libdbus-1-3 rv64g 1.14.6-ok2 [187 kB]
Get:58 http://archive.build.openkylin.top/openkylin yangtze/main rv64g libexpat1 rv64g 2.2.9-ok4 [81.9 kB]
Get:59 http://archive.build.openkylin.top/openkylin yangtze/main rv64g passwd rv64g 1:4.8.1-ok3.1 [721 kB]
Get:60 http://archive.build.openkylin.top/openkylin yangtze/main rv64g libpcre3 rv64g 2:8.39-ok5 [174 kB]
Get:61 http://archive.build.openkylin.top/openkylin yangtze/main rv64g libk5crypto3 rv64g 1.17-ok4 [75.1 kB]
Get:62 http://archive.build.openkylin.top/openkylin yangtze/main rv64g libkrb5support0 rv64g 1.17-ok4 [28.8 kB]
Get:63 http://archive.build.openkylin.top/openkylin yangtze/main rv64g libkrb5-3 rv64g 1.17-ok4 [322 kB]
Get:64 http://archive.build.openkylin.top/openkylin yangtze/main rv64g libgssapi-krb5-2 rv64g 1.17-ok4 [113 kB]
Get:65 http://archive.build.openkylin.top/openkylin yangtze/main rv64g libkeyutils1 rv64g 1.6-ok3 [7756 B]
Get:66 http://archive.build.openkylin.top/openkylin yangtze/main rv64g libpcre2-8-0 rv64g 10.34-ok2 [133 kB]
Get:67 http://archive.build.openkylin.top/openkylin yangtze/main rv64g libncursesw6 rv64g 6.2-ok4 [130 kB]
Get:68 http://archive.build.openkylin.top/openkylin yangtze/main rv64g libtinfo6 rv64g 6.2-ok4 [90.3 kB]
Get:69 http://archive.build.openkylin.top/openkylin yangtze/main rv64g libtext-iconv-perl rv64g 1.7-ok1 [13.7 kB]
Get:70 http://archive.build.openkylin.top/openkylin yangtze/main rv64g tzdata all 2019c-ok1 [292 kB]
Get:71 http://archive.build.openkylin.top/openkylin yangtze/main rv64g readline-common all 8.0-ok2 [52.4 kB]
Get:72 http://archive.build.openkylin.top/openkylin yangtze/main rv64g libreadline8 rv64g 8.0-ok2 [125 kB]
Get:73 http://archive.build.openkylin.top/openkylin yangtze/main rv64g xz-utils rv64g 5.2.4-ok6 [175 kB]
Get:74 http://archive.build.openkylin.top/openkylin yangtze/main rv64g dpkg-dev all 1.21.1-ok6.1 [922 kB]
Get:75 http://archive.build.openkylin.top/openkylin yangtze/main rv64g libdpkg-perl all 1.21.1-ok6.1 [336 kB]
Get:76 http://archive.build.openkylin.top/OTHER/Internal-mirror/rv64g-stage0 yangtze/main rv64g dselect rv64g 1.21.1-ok6.6 [283 kB]
Get:77 http://archive.build.openkylin.top/openkylin yangtze/main rv64g java-common all 0.72-ok4 [6062 B]
Get:78 http://archive.build.openkylin.top/OTHER/Internal-mirror/rv64g-stage0 yangtze/main rv64g libasan8 rv64g 12.2.0-ok7 [2271 kB]
Get:79 http://archive.build.openkylin.top/OTHER/Internal-mirror/rv64g-stage0 yangtze/main rv64g libatomic1 rv64g 12.2.0-ok7 [7708 B]
Get:80 http://archive.build.openkylin.top/OTHER/Internal-mirror/rv64g-stage0 yangtze/main rv64g libcc1-0 rv64g 12.2.0-ok7 [42.9 kB]
Get:81 http://archive.build.openkylin.top/openkylin yangtze/main rv64g libcups2 rv64g 2.4.2-ok4 [229 kB]
Get:82 http://archive.build.openkylin.top/openkylin yangtze/main rv64g zlib1g-dev rv64g 1:1.2.11.dfsg-ok3 [213 kB]
Get:83 http://archive.build.openkylin.top/OTHER/Internal-mirror/rv64g-stage0 yangtze/main rv64g libdpkg-dev rv64g 1.21.1-ok6.6 [131 kB]
Get:84 http://archive.build.openkylin.top/openkylin yangtze/main rv64g libfontconfig1 rv64g 2.13.1-ok1 [326 kB]
Get:85 http://archive.build.openkylin.top/OTHER/Internal-mirror/rv64g-stage0 yangtze/main rv64g libgomp1 rv64g 12.2.0-ok7 [111 kB]
Get:86 http://archive.build.openkylin.top/OTHER/Internal-mirror/rv64g-stage0 yangtze/main rv64g libgcc-12-dev rv64g 12.2.0-ok7 [2471 kB]
Get:87 http://archive.build.openkylin.top/OTHER/Internal-mirror/rv64g-stage0 yangtze/main rv64g libgfortran5 rv64g 12.2.0-ok7 [376 kB]
Get:88 http://archive.build.openkylin.top/openkylin yangtze/main rv64g libgmpxx4ldbl rv64g 2:6.2.0+dfsg-ok3 [9490 B]
Get:89 http://archive.build.openkylin.top/openkylin yangtze/main rv64g libgmp-dev rv64g 2:6.2.0+dfsg-ok3 [794 kB]
Get:90 http://archive.build.openkylin.top/openkylin yangtze/main rv64g libjbig0 rv64g 2.1-ok3 [31.9 kB]
Get:91 http://archive.build.openkylin.top/OTHER/Internal-mirror/rv64g-stage0 yangtze/main rv64g libjpeg-turbo8 rv64g 2.1.2-0ubuntu1 [79.8 kB]
Get:92 http://archive.build.openkylin.top/openkylin yangtze/main rv64g libjpeg62-turbo rv64g 1:2.1.2-ok2 [109 kB]
Get:93 http://archive.build.openkylin.top/openkylin yangtze/main rv64g libsqlite3-0 rv64g 3.39.4-ok4 [790 kB]
Get:94 http://archive.build.openkylin.top/openkylin yangtze/main rv64g libnss3 rv64g 2:3.49.1-ok5 [987 kB]
Get:95 http://archive.build.openkylin.top/OTHER/Internal-mirror/rv64g-stage0 yangtze/main rv64g libobjc4 rv64g 12.2.0-ok7 [45.7 kB]
Get:96 http://archive.build.openkylin.top/openkylin yangtze/main rv64g libpcsclite1 rv64g 1.8.26-ok2.1 [44.7 kB]
Get:97 http://archive.build.openkylin.top/openkylin yangtze/main rv64g libseccomp2 rv64g 2.5.3-ok2 [56.7 kB]
Get:98 http://archive.build.openkylin.top/openkylin yangtze-proposed/main rv64g libwebp7 rv64g 1.2.2-ok4 [173 kB]
Get:99 http://archive.build.openkylin.top/openkylin yangtze/main rv64g libtiff5 rv64g 4.1.0+git191117-ok3 [238 kB]
Get:100 http://archive.build.openkylin.top/openkylin yangtze/main rv64g libxcb1 rv64g 1.14-ok2 [40.8 kB]
Get:101 http://archive.build.openkylin.top/openkylin yangtze/main rv64g libxi6 rv64g 2:1.8-ok3 [78.9 kB]
Get:102 http://archive.build.openkylin.top/openkylin yangtze/main rv64g locales-all rv64g 2.36-ok6 [10.7 MB]
Get:103 http://archive.build.openkylin.top/openkylin yangtze/main rv64g nscd rv64g 2.36-ok6 [75.9 kB]
Get:104 http://archive.build.openkylin.top/openkylin yangtze/main rv64g openssl rv64g 3.0.8-ok4.1 [1148 kB]
Get:105 http://archive.build.openkylin.top/openkylin yangtze/main rv64g pkgbinarymangler all 150-ok1 [15.2 kB]
Preconfiguring packages ...
Fetched 62.6 MB in 1min 28s (710 kB/s)
(Reading database ... 
(Reading database ... 5%
(Reading database ... 10%
(Reading database ... 15%
(Reading database ... 20%
(Reading database ... 25%
(Reading database ... 30%
(Reading database ... 35%
(Reading database ... 40%
(Reading database ... 45%
(Reading database ... 50%
(Reading database ... 55%
(Reading database ... 60%
(Reading database ... 65%
(Reading database ... 70%
(Reading database ... 75%
(Reading database ... 80%
(Reading database ... 85%
(Reading database ... 90%
(Reading database ... 95%
(Reading database ... 100%
(Reading database ... 25064 files and directories currently installed.)
Preparing to unpack .../0-libcrypt-dev_1%3a4.4.10-ok3.1_rv64g.deb ...
Unpacking libcrypt-dev:rv64g (1:4.4.10-ok3.1) over (1:4.4.10-ok1) ...
Preparing to unpack .../1-libc-devtools_2.36-ok6_rv64g.deb ...
Unpacking libc-devtools (2.36-ok6) over (2.36-ok2) ...
Preparing to unpack .../2-libc6-dev_2.36-ok6_rv64g.deb ...
Unpacking libc6-dev:rv64g (2.36-ok6) over (2.36-ok2) ...
Preparing to unpack .../3-libc-dev-bin_2.36-ok6_rv64g.deb ...
Unpacking libc-dev-bin (2.36-ok6) over (2.36-ok2) ...
Preparing to unpack .../4-libc6-prof_2.36-ok6_rv64g.deb ...
Unpacking libc6-prof:rv64g (2.36-ok6) over (2.36-ok2) ...
Preparing to unpack .../5-libgcc-s1_12.2.0-ok7_rv64g.deb ...
Unpacking libgcc-s1:rv64g (12.2.0-ok7) over (12.2.0-ok7) ...
Setting up libgcc-s1:rv64g (12.2.0-ok7) ...
(Reading database ... 
(Reading database ... 5%
(Reading database ... 10%
(Reading database ... 15%
(Reading database ... 20%
(Reading database ... 25%
(Reading database ... 30%
(Reading database ... 35%
(Reading database ... 40%
(Reading database ... 45%
(Reading database ... 50%
(Reading database ... 55%
(Reading database ... 60%
(Reading database ... 65%
(Reading database ... 70%
(Reading database ... 75%
(Reading database ... 80%
(Reading database ... 85%
(Reading database ... 90%
(Reading database ... 95%
(Reading database ... 100%
(Reading database ... 25064 files and directories currently installed.)
Preparing to unpack .../libcrypt1_1%3a4.4.10-ok3.1_rv64g.deb ...
Unpacking libcrypt1:rv64g (1:4.4.10-ok3.1) over (1:4.4.10-ok1) ...
Setting up libcrypt1:rv64g (1:4.4.10-ok3.1) ...
(Reading database ... 
(Reading database ... 5%
(Reading database ... 10%
(Reading database ... 15%
(Reading database ... 20%
(Reading database ... 25%
(Reading database ... 30%
(Reading database ... 35%
(Reading database ... 40%
(Reading database ... 45%
(Reading database ... 50%
(Reading database ... 55%
(Reading database ... 60%
(Reading database ... 65%
(Reading database ... 70%
(Reading database ... 75%
(Reading database ... 80%
(Reading database ... 85%
(Reading database ... 90%
(Reading database ... 95%
(Reading database ... 100%
(Reading database ... 25064 files and directories currently installed.)
Preparing to unpack .../libc6_2.36-ok6_rv64g.deb ...
Unpacking libc6:rv64g (2.36-ok6) over (2.36-ok2) ...
Setting up libc6:rv64g (2.36-ok6) ...
(Reading database ... 
(Reading database ... 5%
(Reading database ... 10%
(Reading database ... 15%
(Reading database ... 20%
(Reading database ... 25%
(Reading database ... 30%
(Reading database ... 35%
(Reading database ... 40%
(Reading database ... 45%
(Reading database ... 50%
(Reading database ... 55%
(Reading database ... 60%
(Reading database ... 65%
(Reading database ... 70%
(Reading database ... 75%
(Reading database ... 80%
(Reading database ... 85%
(Reading database ... 90%
(Reading database ... 95%
(Reading database ... 100%
(Reading database ... 25064 files and directories currently installed.)
Preparing to unpack .../base-files_11-ok13.1_rv64g.deb ...
Unpacking base-files (11-ok13.1) over (11-ok0) ...
Setting up base-files (11-ok13.1) ...
Installing new version of config file /etc/default/motd-news ...
Installing new version of config file /etc/issue ...
Installing new version of config file /etc/issue.net ...
Installing new version of config file /etc/legal ...
Installing new version of config file /etc/lsb-release ...
Installing new version of config file /etc/update-motd.d/10-help-text ...
(Reading database ... 
(Reading database ... 5%
(Reading database ... 10%
(Reading database ... 15%
(Reading database ... 20%
(Reading database ... 25%
(Reading database ... 30%
(Reading database ... 35%
(Reading database ... 40%
(Reading database ... 45%
(Reading database ... 50%
(Reading database ... 55%
(Reading database ... 60%
(Reading database ... 65%
(Reading database ... 70%
(Reading database ... 75%
(Reading database ... 80%
(Reading database ... 85%
(Reading database ... 90%
(Reading database ... 95%
(Reading database ... 100%
(Reading database ... 25064 files and directories currently installed.)
Preparing to unpack .../bash_5.0-ok4_rv64g.deb ...
Unpacking bash (5.0-ok4) over (5.0-ok3) ...
Setting up bash (5.0-ok4) ...
update-alternatives: using /usr/share/man/man7/bash-builtins.7.gz to provide /usr/share/man/man7/builtins.7.gz (builtins.7.gz) in auto mode
(Reading database ... 
(Reading database ... 5%
(Reading database ... 10%
(Reading database ... 15%
(Reading database ... 20%
(Reading database ... 25%
(Reading database ... 30%
(Reading database ... 35%
(Reading database ... 40%
(Reading database ... 45%
(Reading database ... 50%
(Reading database ... 55%
(Reading database ... 60%
(Reading database ... 65%
(Reading database ... 70%
(Reading database ... 75%
(Reading database ... 80%
(Reading database ... 85%
(Reading database ... 90%
(Reading database ... 95%
(Reading database ... 100%
(Reading database ... 25064 files and directories currently installed.)
Preparing to unpack .../bsdutils_1%3a2.38.1-ok5build1_rv64g.deb ...
Unpacking bsdutils (1:2.38.1-ok5build1) over (1:2.38.1-ok5build1) ...
Setting up bsdutils (1:2.38.1-ok5build1) ...
(Reading database ... 
(Reading database ... 5%
(Reading database ... 10%
(Reading database ... 15%
(Reading database ... 20%
(Reading database ... 25%
(Reading database ... 30%
(Reading database ... 35%
(Reading database ... 40%
(Reading database ... 45%
(Reading database ... 50%
(Reading database ... 55%
(Reading database ... 60%
(Reading database ... 65%
(Reading database ... 70%
(Reading database ... 75%
(Reading database ... 80%
(Reading database ... 85%
(Reading database ... 90%
(Reading database ... 95%
(Reading database ... 100%
(Reading database ... 25064 files and directories currently installed.)
Preparing to unpack .../coreutils_8.30-ok4_rv64g.deb ...
Unpacking coreutils (8.30-ok4) over (8.30-ok3) ...
Setting up coreutils (8.30-ok4) ...
(Reading database ... 
(Reading database ... 5%
(Reading database ... 10%
(Reading database ... 15%
(Reading database ... 20%
(Reading database ... 25%
(Reading database ... 30%
(Reading database ... 35%
(Reading database ... 40%
(Reading database ... 45%
(Reading database ... 50%
(Reading database ... 55%
(Reading database ... 60%
(Reading database ... 65%
(Reading database ... 70%
(Reading database ... 75%
(Reading database ... 80%
(Reading database ... 85%
(Reading database ... 90%
(Reading database ... 95%
(Reading database ... 100%
(Reading database ... 25064 files and directories currently installed.)
Preparing to unpack .../diffutils_1%3a3.7-ok2_rv64g.deb ...
Unpacking diffutils (1:3.7-ok2) over (1:3.7-ok1) ...
Setting up diffutils (1:3.7-ok2) ...
(Reading database ... 
(Reading database ... 5%
(Reading database ... 10%
(Reading database ... 15%
(Reading database ... 20%
(Reading database ... 25%
(Reading database ... 30%
(Reading database ... 35%
(Reading database ... 40%
(Reading database ... 45%
(Reading database ... 50%
(Reading database ... 55%
(Reading database ... 60%
(Reading database ... 65%
(Reading database ... 70%
(Reading database ... 75%
(Reading database ... 80%
(Reading database ... 85%
(Reading database ... 90%
(Reading database ... 95%
(Reading database ... 100%
(Reading database ... 25064 files and directories currently installed.)
Removing libapt-pkg6.0-dbgsym:rv64g (2.5.4-ok4) ...
(Reading database ... 
(Reading database ... 5%
(Reading database ... 10%
(Reading database ... 15%
(Reading database ... 20%
(Reading database ... 25%
(Reading database ... 30%
(Reading database ... 35%
(Reading database ... 40%
(Reading database ... 45%
(Reading database ... 50%
(Reading database ... 55%
(Reading database ... 60%
(Reading database ... 65%
(Reading database ... 70%
(Reading database ... 75%
(Reading database ... 80%
(Reading database ... 85%
(Reading database ... 90%
(Reading database ... 95%
(Reading database ... 100%
(Reading database ... 25061 files and directories currently installed.)
Preparing to unpack .../libapt-pkg-dev_2.5.4-ok6.2_rv64g.deb ...
Unpacking libapt-pkg-dev:rv64g (2.5.4-ok6.2) over (2.5.4-ok4) ...
Preparing to unpack .../liblz4-1_1.9.2-ok3_rv64g.deb ...
Unpacking liblz4-1:rv64g (1.9.2-ok3) over (1.9.2-ok3) ...
Setting up liblz4-1:rv64g (1.9.2-ok3) ...
(Reading database ... 
(Reading database ... 5%
(Reading database ... 10%
(Reading database ... 15%
(Reading database ... 20%
(Reading database ... 25%
(Reading database ... 30%
(Reading database ... 35%
(Reading database ... 40%
(Reading database ... 45%
(Reading database ... 50%
(Reading database ... 55%
(Reading database ... 60%
(Reading database ... 65%
(Reading database ... 70%
(Reading database ... 75%
(Reading database ... 80%
(Reading database ... 85%
(Reading database ... 90%
(Reading database ... 95%
(Reading database ... 100%
(Reading database ... 25061 files and directories currently installed.)
Preparing to unpack .../liblzma-dev_5.2.4-ok6_rv64g.deb ...
Unpacking liblzma-dev:rv64g (5.2.4-ok6) over (5.2.4-ok4) ...
Preparing to unpack .../liblzma5_5.2.4-ok6_rv64g.deb ...
Unpacking liblzma5:rv64g (5.2.4-ok6) over (5.2.4-ok4) ...
Setting up liblzma5:rv64g (5.2.4-ok6) ...
(Reading database ... 
(Reading database ... 5%
(Reading database ... 10%
(Reading database ... 15%
(Reading database ... 20%
(Reading database ... 25%
(Reading database ... 30%
(Reading database ... 35%
(Reading database ... 40%
(Reading database ... 45%
(Reading database ... 50%
(Reading database ... 55%
(Reading database ... 60%
(Reading database ... 65%
(Reading database ... 70%
(Reading database ... 75%
(Reading database ... 80%
(Reading database ... 85%
(Reading database ... 90%
(Reading database ... 95%
(Reading database ... 100%
(Reading database ... 25061 files and directories currently installed.)
Preparing to unpack .../systemd-timesyncd_251.4-ok1.7_rv64g.deb ...
Unpacking systemd-timesyncd (251.4-ok1.7) over (251.4-ok1.3) ...
Preparing to unpack .../libaudit-common_1%3a2.8.5-ok3.1_all.deb ...
Unpacking libaudit-common (1:2.8.5-ok3.1) over (1:2.8.5-ok2) ...
Setting up libaudit-common (1:2.8.5-ok3.1) ...
(Reading database ... 
(Reading database ... 5%
(Reading database ... 10%
(Reading database ... 15%
(Reading database ... 20%
(Reading database ... 25%
(Reading database ... 30%
(Reading database ... 35%
(Reading database ... 40%
(Reading database ... 45%
(Reading database ... 50%
(Reading database ... 55%
(Reading database ... 60%
(Reading database ... 65%
(Reading database ... 70%
(Reading database ... 75%
(Reading database ... 80%
(Reading database ... 85%
(Reading database ... 90%
(Reading database ... 95%
(Reading database ... 100%
(Reading database ... 25061 files and directories currently installed.)
Preparing to unpack .../libaudit1_1%3a2.8.5-ok3.1_rv64g.deb ...
Unpacking libaudit1:rv64g (1:2.8.5-ok3.1) over (1:2.8.5-ok2) ...
Setting up libaudit1:rv64g (1:2.8.5-ok3.1) ...
(Reading database ... 
(Reading database ... 5%
(Reading database ... 10%
(Reading database ... 15%
(Reading database ... 20%
(Reading database ... 25%
(Reading database ... 30%
(Reading database ... 35%
(Reading database ... 40%
(Reading database ... 45%
(Reading database ... 50%
(Reading database ... 55%
(Reading database ... 60%
(Reading database ... 65%
(Reading database ... 70%
(Reading database ... 75%
(Reading database ... 80%
(Reading database ... 85%
(Reading database ... 90%
(Reading database ... 95%
(Reading database ... 100%
(Reading database ... 25061 files and directories currently installed.)
Preparing to unpack .../libmount1_2.38.1-ok5build1_rv64g.deb ...
Unpacking libmount1:rv64g (2.38.1-ok5build1) over (2.38.1-ok5build1) ...
Setting up libmount1:rv64g (2.38.1-ok5build1) ...
(Reading database ... 
(Reading database ... 5%
(Reading database ... 10%
(Reading database ... 15%
(Reading database ... 20%
(Reading database ... 25%
(Reading database ... 30%
(Reading database ... 35%
(Reading database ... 40%
(Reading database ... 45%
(Reading database ... 50%
(Reading database ... 55%
(Reading database ... 60%
(Reading database ... 65%
(Reading database ... 70%
(Reading database ... 75%
(Reading database ... 80%
(Reading database ... 85%
(Reading database ... 90%
(Reading database ... 95%
(Reading database ... 100%
(Reading database ... 25061 files and directories currently installed.)
Preparing to unpack .../libssl3_3.0.8-ok4.1_rv64g.deb ...
Unpacking libssl3:rv64g (3.0.8-ok4.1) over (3.0.8-ok3) ...
Setting up libssl3:rv64g (3.0.8-ok4.1) ...
(Reading database ... 
(Reading database ... 5%
(Reading database ... 10%
(Reading database ... 15%
(Reading database ... 20%
(Reading database ... 25%
(Reading database ... 30%
(Reading database ... 35%
(Reading database ... 40%
(Reading database ... 45%
(Reading database ... 50%
(Reading database ... 55%
(Reading database ... 60%
(Reading database ... 65%
(Reading database ... 70%
(Reading database ... 75%
(Reading database ... 80%
(Reading database ... 85%
(Reading database ... 90%
(Reading database ... 95%
(Reading database ... 100%
(Reading database ... 25061 files and directories currently installed.)
Preparing to unpack .../systemd-sysv_251.4-ok1.7_rv64g.deb ...
Unpacking systemd-sysv (251.4-ok1.7) over (251.4-ok1.3) ...
Preparing to unpack .../systemd_251.4-ok1.7_rv64g.deb ...
Unpacking systemd (251.4-ok1.7) over (251.4-ok1.3) ...
Preparing to unpack .../libsystemd-shared_251.4-ok1.7_rv64g.deb ...
Unpacking libsystemd-shared:rv64g (251.4-ok1.7) over (251.4-ok1.3) ...
Preparing to unpack .../libudev1_251.4-ok1.7_rv64g.deb ...
Unpacking libudev1:rv64g (251.4-ok1.7) over (251.4-ok1.3) ...
Setting up libudev1:rv64g (251.4-ok1.7) ...
(Reading database ... 
(Reading database ... 5%
(Reading database ... 10%
(Reading database ... 15%
(Reading database ... 20%
(Reading database ... 25%
(Reading database ... 30%
(Reading database ... 35%
(Reading database ... 40%
(Reading database ... 45%
(Reading database ... 50%
(Reading database ... 55%
(Reading database ... 60%
(Reading database ... 65%
(Reading database ... 70%
(Reading database ... 75%
(Reading database ... 80%
(Reading database ... 85%
(Reading database ... 90%
(Reading database ... 95%
(Reading database ... 100%
(Reading database ... 25058 files and directories currently installed.)
Preparing to unpack .../libdevmapper1.02.1_2%3a1.02.167-ok3_rv64g.deb ...
Unpacking libdevmapper1.02.1:rv64g (2:1.02.167-ok3) over (2:1.02.167-ok2) ...
Preparing to unpack .../libcryptsetup12_2%3a2.2.2-ok6_rv64g.deb ...
Unpacking libcryptsetup12:rv64g (2:2.2.2-ok6) over (2:2.2.2-ok5) ...
Preparing to unpack .../mount_2.38.1-ok5build1_rv64g.deb ...
Unpacking mount (2.38.1-ok5build1) over (2.38.1-ok5build1) ...
Preparing to unpack .../libsystemd0_251.4-ok1.7_rv64g.deb ...
Unpacking libsystemd0:rv64g (251.4-ok1.7) over (251.4-ok1.3) ...
Setting up libsystemd0:rv64g (251.4-ok1.7) ...
(Reading database ... 
(Reading database ... 5%
(Reading database ... 10%
(Reading database ... 15%
(Reading database ... 20%
(Reading database ... 25%
(Reading database ... 30%
(Reading database ... 35%
(Reading database ... 40%
(Reading database ... 45%
(Reading database ... 50%
(Reading database ... 55%
(Reading database ... 60%
(Reading database ... 65%
(Reading database ... 70%
(Reading database ... 75%
(Reading database ... 80%
(Reading database ... 85%
(Reading database ... 90%
(Reading database ... 95%
(Reading database ... 100%
(Reading database ... 25056 files and directories currently installed.)
Preparing to unpack .../libapt-pkg6.0_2.5.4-ok6.2_rv64g.deb ...
Unpacking libapt-pkg6.0:rv64g (2.5.4-ok6.2) over (2.5.4-ok4) ...
Setting up libapt-pkg6.0:rv64g (2.5.4-ok6.2) ...
(Reading database ... 
(Reading database ... 5%
(Reading database ... 10%
(Reading database ... 15%
(Reading database ... 20%
(Reading database ... 25%
(Reading database ... 30%
(Reading database ... 35%
(Reading database ... 40%
(Reading database ... 45%
(Reading database ... 50%
(Reading database ... 55%
(Reading database ... 60%
(Reading database ... 65%
(Reading database ... 70%
(Reading database ... 75%
(Reading database ... 80%
(Reading database ... 85%
(Reading database ... 90%
(Reading database ... 95%
(Reading database ... 100%
(Reading database ... 25056 files and directories currently installed.)
Removing dpkg-dbgsym (1.21.1-ok6) ...
(Reading database ... 
(Reading database ... 5%
(Reading database ... 10%
(Reading database ... 15%
(Reading database ... 20%
(Reading database ... 25%
(Reading database ... 30%
(Reading database ... 35%
(Reading database ... 40%
(Reading database ... 45%
(Reading database ... 50%
(Reading database ... 55%
(Reading database ... 60%
(Reading database ... 65%
(Reading database ... 70%
(Reading database ... 75%
(Reading database ... 80%
(Reading database ... 85%
(Reading database ... 90%
(Reading database ... 95%
(Reading database ... 100%
(Reading database ... 25040 files and directories currently installed.)
Preparing to unpack .../tar_1.30+dfsg-ok5_rv64g.deb ...
Unpacking tar (1.30+dfsg-ok5) over (1.30+dfsg-ok4) ...
Setting up tar (1.30+dfsg-ok5) ...
(Reading database ... 
(Reading database ... 5%
(Reading database ... 10%
(Reading database ... 15%
(Reading database ... 20%
(Reading database ... 25%
(Reading database ... 30%
(Reading database ... 35%
(Reading database ... 40%
(Reading database ... 45%
(Reading database ... 50%
(Reading database ... 55%
(Reading database ... 60%
(Reading database ... 65%
(Reading database ... 70%
(Reading database ... 75%
(Reading database ... 80%
(Reading database ... 85%
(Reading database ... 90%
(Reading database ... 95%
(Reading database ... 100%
(Reading database ... 25042 files and directories currently installed.)
Preparing to unpack .../dpkg_1.21.1-ok6.6_rv64g.deb ...
Unpacking dpkg (1.21.1-ok6.6) over (1.21.1-ok6) ...
Setting up dpkg (1.21.1-ok6.6) ...
(Reading database ... 
(Reading database ... 5%
(Reading database ... 10%
(Reading database ... 15%
(Reading database ... 20%
(Reading database ... 25%
(Reading database ... 30%
(Reading database ... 35%
(Reading database ... 40%
(Reading database ... 45%
(Reading database ... 50%
(Reading database ... 55%
(Reading database ... 60%
(Reading database ... 65%
(Reading database ... 70%
(Reading database ... 75%
(Reading database ... 80%
(Reading database ... 85%
(Reading database ... 90%
(Reading database ... 95%
(Reading database ... 100%
(Reading database ... 25042 files and directories currently installed.)
Preparing to unpack .../grep_3.4-ok3_rv64g.deb ...
Unpacking grep (3.4-ok3) over (3.4-ok1) ...
Setting up grep (3.4-ok3) ...
(Reading database ... 
(Reading database ... 5%
(Reading database ... 10%
(Reading database ... 15%
(Reading database ... 20%
(Reading database ... 25%
(Reading database ... 30%
(Reading database ... 35%
(Reading database ... 40%
(Reading database ... 45%
(Reading database ... 50%
(Reading database ... 55%
(Reading database ... 60%
(Reading database ... 65%
(Reading database ... 70%
(Reading database ... 75%
(Reading database ... 80%
(Reading database ... 85%
(Reading database ... 90%
(Reading database ... 95%
(Reading database ... 100%
(Reading database ... 25042 files and directories currently installed.)
Preparing to unpack .../gzip_1.10-ok4_rv64g.deb ...
Unpacking gzip (1.10-ok4) over (1.10-ok3) ...
Setting up gzip (1.10-ok4) ...
(Reading database ... 
(Reading database ... 5%
(Reading database ... 10%
(Reading database ... 15%
(Reading database ... 20%
(Reading database ... 25%
(Reading database ... 30%
(Reading database ... 35%
(Reading database ... 40%
(Reading database ... 45%
(Reading database ... 50%
(Reading database ... 55%
(Reading database ... 60%
(Reading database ... 65%
(Reading database ... 70%
(Reading database ... 75%
(Reading database ... 80%
(Reading database ... 85%
(Reading database ... 90%
(Reading database ... 95%
(Reading database ... 100%
(Reading database ... 25042 files and directories currently installed.)
Preparing to unpack .../login_1%3a4.8.1-ok3.1_rv64g.deb ...
Unpacking login (1:4.8.1-ok3.1) over (1:4.8.1-ok2) ...
Setting up login (1:4.8.1-ok3.1) ...
(Reading database ... 
(Reading database ... 5%
(Reading database ... 10%
(Reading database ... 15%
(Reading database ... 20%
(Reading database ... 25%
(Reading database ... 30%
(Reading database ... 35%
(Reading database ... 40%
(Reading database ... 45%
(Reading database ... 50%
(Reading database ... 55%
(Reading database ... 60%
(Reading database ... 65%
(Reading database ... 70%
(Reading database ... 75%
(Reading database ... 80%
(Reading database ... 85%
(Reading database ... 90%
(Reading database ... 95%
(Reading database ... 100%
(Reading database ... 25042 files and directories currently installed.)
Preparing to unpack .../ncurses-bin_6.2-ok4_rv64g.deb ...
Unpacking ncurses-bin (6.2-ok4) over (6.2-ok2) ...
Setting up ncurses-bin (6.2-ok4) ...
(Reading database ... 
(Reading database ... 5%
(Reading database ... 10%
(Reading database ... 15%
(Reading database ... 20%
(Reading database ... 25%
(Reading database ... 30%
(Reading database ... 35%
(Reading database ... 40%
(Reading database ... 45%
(Reading database ... 50%
(Reading database ... 55%
(Reading database ... 60%
(Reading database ... 65%
(Reading database ... 70%
(Reading database ... 75%
(Reading database ... 80%
(Reading database ... 85%
(Reading database ... 90%
(Reading database ... 95%
(Reading database ... 100%
(Reading database ... 25041 files and directories currently installed.)
Preparing to unpack .../libperl5.30_5.30.0-ok6_rv64g.deb ...
Unpacking libperl5.30:rv64g (5.30.0-ok6) over (5.30.0-ok4) ...
Preparing to unpack .../perl_5.30.0-ok6_rv64g.deb ...
Unpacking perl (5.30.0-ok6) over (5.30.0-ok4) ...
Preparing to unpack .../perl-base_5.30.0-ok6_rv64g.deb ...
Unpacking perl-base (5.30.0-ok6) over (5.30.0-ok4) ...
Setting up perl-base (5.30.0-ok6) ...
(Reading database ... 
(Reading database ... 5%
(Reading database ... 10%
(Reading database ... 15%
(Reading database ... 20%
(Reading database ... 25%
(Reading database ... 30%
(Reading database ... 35%
(Reading database ... 40%
(Reading database ... 45%
(Reading database ... 50%
(Reading database ... 55%
(Reading database ... 60%
(Reading database ... 65%
(Reading database ... 70%
(Reading database ... 75%
(Reading database ... 80%
(Reading database ... 85%
(Reading database ... 90%
(Reading database ... 95%
(Reading database ... 100%
(Reading database ... 25039 files and directories currently installed.)
Preparing to unpack .../perl-modules-5.30_5.30.0-ok6_all.deb ...
Unpacking perl-modules-5.30 (5.30.0-ok6) over (5.30.0-ok4) ...
Preparing to unpack .../libdb5.3_5.3.28+dfsg1-ok1_rv64g.deb ...
Unpacking libdb5.3:rv64g (5.3.28+dfsg1-ok1) over (5.3.28+dfsg1-ok1) ...
Setting up libdb5.3:rv64g (5.3.28+dfsg1-ok1) ...
(Reading database ... 
(Reading database ... 5%
(Reading database ... 10%
(Reading database ... 15%
(Reading database ... 20%
(Reading database ... 25%
(Reading database ... 30%
(Reading database ... 35%
(Reading database ... 40%
(Reading database ... 45%
(Reading database ... 50%
(Reading database ... 55%
(Reading database ... 60%
(Reading database ... 65%
(Reading database ... 70%
(Reading database ... 75%
(Reading database ... 80%
(Reading database ... 85%
(Reading database ... 90%
(Reading database ... 95%
(Reading database ... 100%
(Reading database ... 25038 files and directories currently installed.)
Preparing to unpack .../util-linux_2.38.1-ok5build1_rv64g.deb ...
Unpacking util-linux (2.38.1-ok5build1) over (2.38.1-ok5build1) ...
Setting up util-linux (2.38.1-ok5build1) ...
(Reading database ... 
(Reading database ... 5%
(Reading database ... 10%
(Reading database ... 15%
(Reading database ... 20%
(Reading database ... 25%
(Reading database ... 30%
(Reading database ... 35%
(Reading database ... 40%
(Reading database ... 45%
(Reading database ... 50%
(Reading database ... 55%
(Reading database ... 60%
(Reading database ... 65%
(Reading database ... 70%
(Reading database ... 75%
(Reading database ... 80%
(Reading database ... 85%
(Reading database ... 90%
(Reading database ... 95%
(Reading database ... 100%
(Reading database ... 25038 files and directories currently installed.)
Preparing to unpack .../libc-bin_2.36-ok6_rv64g.deb ...
Unpacking libc-bin (2.36-ok6) over (2.36-ok2) ...
Setting up libc-bin (2.36-ok6) ...
(Reading database ... 
(Reading database ... 5%
(Reading database ... 10%
(Reading database ... 15%
(Reading database ... 20%
(Reading database ... 25%
(Reading database ... 30%
(Reading database ... 35%
(Reading database ... 40%
(Reading database ... 45%
(Reading database ... 50%
(Reading database ... 55%
(Reading database ... 60%
(Reading database ... 65%
(Reading database ... 70%
(Reading database ... 75%
(Reading database ... 80%
(Reading database ... 85%
(Reading database ... 90%
(Reading database ... 95%
(Reading database ... 100%
(Reading database ... 25038 files and directories currently installed.)
Preparing to unpack .../ncurses-base_6.2-ok4_all.deb ...
Unpacking ncurses-base (6.2-ok4) over (6.2-ok2) ...
Setting up ncurses-base (6.2-ok4) ...
(Reading database ... 
(Reading database ... 5%
(Reading database ... 10%
(Reading database ... 15%
(Reading database ... 20%
(Reading database ... 25%
(Reading database ... 30%
(Reading database ... 35%
(Reading database ... 40%
(Reading database ... 45%
(Reading database ... 50%
(Reading database ... 55%
(Reading database ... 60%
(Reading database ... 65%
(Reading database ... 70%
(Reading database ... 75%
(Reading database ... 80%
(Reading database ... 85%
(Reading database ... 90%
(Reading database ... 95%
(Reading database ... 100%
(Reading database ... 25037 files and directories currently installed.)
Removing apt-utils-dbgsym (2.5.4-ok4) ...
Removing apt-dbgsym (2.5.4-ok4) ...
(Reading database ... 
(Reading database ... 5%
(Reading database ... 10%
(Reading database ... 15%
(Reading database ... 20%
(Reading database ... 25%
(Reading database ... 30%
(Reading database ... 35%
(Reading database ... 40%
(Reading database ... 45%
(Reading database ... 50%
(Reading database ... 55%
(Reading database ... 60%
(Reading database ... 65%
(Reading database ... 70%
(Reading database ... 75%
(Reading database ... 80%
(Reading database ... 85%
(Reading database ... 90%
(Reading database ... 95%
(Reading database ... 100%
(Reading database ... 24987 files and directories currently installed.)
Preparing to unpack .../apt_2.5.4-ok6.2_rv64g.deb ...
Unpacking apt (2.5.4-ok6.2) over (2.5.4-ok4) ...
Setting up apt (2.5.4-ok6.2) ...
(Reading database ... 
(Reading database ... 5%
(Reading database ... 10%
(Reading database ... 15%
(Reading database ... 20%
(Reading database ... 25%
(Reading database ... 30%
(Reading database ... 35%
(Reading database ... 40%
(Reading database ... 45%
(Reading database ... 50%
(Reading database ... 55%
(Reading database ... 60%
(Reading database ... 65%
(Reading database ... 70%
(Reading database ... 75%
(Reading database ... 80%
(Reading database ... 85%
(Reading database ... 90%
(Reading database ... 95%
(Reading database ... 100%
(Reading database ... 24987 files and directories currently installed.)
Preparing to unpack .../apt-utils_2.5.4-ok6.2_rv64g.deb ...
Unpacking apt-utils (2.5.4-ok6.2) over (2.5.4-ok4) ...
Preparing to unpack .../libffi8_3.4.4-ok4_rv64g.deb ...
Unpacking libffi8:rv64g (3.4.4-ok4) over (3.4.4-ok3) ...
Setting up libffi8:rv64g (3.4.4-ok4) ...
(Reading database ... 
(Reading database ... 5%
(Reading database ... 10%
(Reading database ... 15%
(Reading database ... 20%
(Reading database ... 25%
(Reading database ... 30%
(Reading database ... 35%
(Reading database ... 40%
(Reading database ... 45%
(Reading database ... 50%
(Reading database ... 55%
(Reading database ... 60%
(Reading database ... 65%
(Reading database ... 70%
(Reading database ... 75%
(Reading database ... 80%
(Reading database ... 85%
(Reading database ... 90%
(Reading database ... 95%
(Reading database ... 100%
(Reading database ... 24987 files and directories currently installed.)
Preparing to unpack .../libp11-kit0_0.23.20-ok2_rv64g.deb ...
Unpacking libp11-kit0:rv64g (0.23.20-ok2) over (0.23.20-ok1) ...
Setting up libp11-kit0:rv64g (0.23.20-ok2) ...
(Reading database ... 
(Reading database ... 5%
(Reading database ... 10%
(Reading database ... 15%
(Reading database ... 20%
(Reading database ... 25%
(Reading database ... 30%
(Reading database ... 35%
(Reading database ... 40%
(Reading database ... 45%
(Reading database ... 50%
(Reading database ... 55%
(Reading database ... 60%
(Reading database ... 65%
(Reading database ... 70%
(Reading database ... 75%
(Reading database ... 80%
(Reading database ... 85%
(Reading database ... 90%
(Reading database ... 95%
(Reading database ... 100%
(Reading database ... 24986 files and directories currently installed.)
Preparing to unpack .../libgnutls30_3.6.13-ok12.1_rv64g.deb ...
Unpacking libgnutls30:rv64g (3.6.13-ok12.1) over (3.6.13-ok9) ...
Setting up libgnutls30:rv64g (3.6.13-ok12.1) ...
(Reading database ... 
(Reading database ... 5%
(Reading database ... 10%
(Reading database ... 15%
(Reading database ... 20%
(Reading database ... 25%
(Reading database ... 30%
(Reading database ... 35%
(Reading database ... 40%
(Reading database ... 45%
(Reading database ... 50%
(Reading database ... 55%
(Reading database ... 60%
(Reading database ... 65%
(Reading database ... 70%
(Reading database ... 75%
(Reading database ... 80%
(Reading database ... 85%
(Reading database ... 90%
(Reading database ... 95%
(Reading database ... 100%
(Reading database ... 24986 files and directories currently installed.)
Removing dselect-dbgsym (1.21.1-ok6) ...
Removing nscd-dbgsym (2.36-ok2) ...
(Reading database ... 
(Reading database ... 5%
(Reading database ... 10%
(Reading database ... 15%
(Reading database ... 20%
(Reading database ... 25%
(Reading database ... 30%
(Reading database ... 35%
(Reading database ... 40%
(Reading database ... 45%
(Reading database ... 50%
(Reading database ... 55%
(Reading database ... 60%
(Reading database ... 65%
(Reading database ... 70%
(Reading database ... 75%
(Reading database ... 80%
(Reading database ... 85%
(Reading database ... 90%
(Reading database ... 95%
(Reading database ... 100%
(Reading database ... 24979 files and directories currently installed.)
Preparing to unpack .../0-liblocale-gettext-perl_1.07-ok1_rv64g.deb ...
Unpacking liblocale-gettext-perl (1.07-ok1) over (1.07-ok1) ...
Preparing to unpack .../1-dbus-bin_1.14.6-ok2_rv64g.deb ...
Unpacking dbus-bin (1.14.6-ok2) over (1.14.6-ok1) ...
Preparing to unpack .../2-dbus-system-bus-common_1.14.6-ok2_all.deb ...
Unpacking dbus-system-bus-common (1.14.6-ok2) over (1.14.6-ok1) ...
Preparing to unpack .../3-dbus-session-bus-common_1.14.6-ok2_all.deb ...
Unpacking dbus-session-bus-common (1.14.6-ok2) over (1.14.6-ok1) ...
Preparing to unpack .../4-dbus_1.14.6-ok2_rv64g.deb ...
/etc/dbus-1/conf is ok
Unpacking dbus (1.14.6-ok2) over (1.14.6-ok1) ...
Preparing to unpack .../5-dbus-daemon_1.14.6-ok2_rv64g.deb ...
Unpacking dbus-daemon (1.14.6-ok2) over (1.14.6-ok1) ...
Preparing to unpack .../6-libdbus-1-3_1.14.6-ok2_rv64g.deb ...
Unpacking libdbus-1-3:rv64g (1.14.6-ok2) over (1.14.6-ok1) ...
Preparing to unpack .../7-libexpat1_2.2.9-ok4_rv64g.deb ...
Unpacking libexpat1:rv64g (2.2.9-ok4) over (2.2.9-ok3) ...
Preparing to unpack .../8-passwd_1%3a4.8.1-ok3.1_rv64g.deb ...
Unpacking passwd (1:4.8.1-ok3.1) over (1:4.8.1-ok2) ...
Setting up passwd (1:4.8.1-ok3.1) ...
(Reading database ... 
(Reading database ... 5%
(Reading database ... 10%
(Reading database ... 15%
(Reading database ... 20%
(Reading database ... 25%
(Reading database ... 30%
(Reading database ... 35%
(Reading database ... 40%
(Reading database ... 45%
(Reading database ... 50%
(Reading database ... 55%
(Reading database ... 60%
(Reading database ... 65%
(Reading database ... 70%
(Reading database ... 75%
(Reading database ... 80%
(Reading database ... 85%
(Reading database ... 90%
(Reading database ... 95%
(Reading database ... 100%
(Reading database ... 24979 files and directories currently installed.)
Preparing to unpack .../libpcre3_2%3a8.39-ok5_rv64g.deb ...
Unpacking libpcre3:rv64g (2:8.39-ok5) over (2:8.39-ok3) ...
Setting up libpcre3:rv64g (2:8.39-ok5) ...
(Reading database ... 
(Reading database ... 5%
(Reading database ... 10%
(Reading database ... 15%
(Reading database ... 20%
(Reading database ... 25%
(Reading database ... 30%
(Reading database ... 35%
(Reading database ... 40%
(Reading database ... 45%
(Reading database ... 50%
(Reading database ... 55%
(Reading database ... 60%
(Reading database ... 65%
(Reading database ... 70%
(Reading database ... 75%
(Reading database ... 80%
(Reading database ... 85%
(Reading database ... 90%
(Reading database ... 95%
(Reading database ... 100%
(Reading database ... 24979 files and directories currently installed.)
Preparing to unpack .../libk5crypto3_1.17-ok4_rv64g.deb ...
Unpacking libk5crypto3:rv64g (1.17-ok4) over (1.17-ok3) ...
Setting up libk5crypto3:rv64g (1.17-ok4) ...
(Reading database ... 
(Reading database ... 5%
(Reading database ... 10%
(Reading database ... 15%
(Reading database ... 20%
(Reading database ... 25%
(Reading database ... 30%
(Reading database ... 35%
(Reading database ... 40%
(Reading database ... 45%
(Reading database ... 50%
(Reading database ... 55%
(Reading database ... 60%
(Reading database ... 65%
(Reading database ... 70%
(Reading database ... 75%
(Reading database ... 80%
(Reading database ... 85%
(Reading database ... 90%
(Reading database ... 95%
(Reading database ... 100%
(Reading database ... 24979 files and directories currently installed.)
Preparing to unpack .../libkrb5support0_1.17-ok4_rv64g.deb ...
Unpacking libkrb5support0:rv64g (1.17-ok4) over (1.17-ok3) ...
Setting up libkrb5support0:rv64g (1.17-ok4) ...
(Reading database ... 
(Reading database ... 5%
(Reading database ... 10%
(Reading database ... 15%
(Reading database ... 20%
(Reading database ... 25%
(Reading database ... 30%
(Reading database ... 35%
(Reading database ... 40%
(Reading database ... 45%
(Reading database ... 50%
(Reading database ... 55%
(Reading database ... 60%
(Reading database ... 65%
(Reading database ... 70%
(Reading database ... 75%
(Reading database ... 80%
(Reading database ... 85%
(Reading database ... 90%
(Reading database ... 95%
(Reading database ... 100%
(Reading database ... 24979 files and directories currently installed.)
Preparing to unpack .../libkrb5-3_1.17-ok4_rv64g.deb ...
Unpacking libkrb5-3:rv64g (1.17-ok4) over (1.17-ok3) ...
Setting up libkrb5-3:rv64g (1.17-ok4) ...
(Reading database ... 
(Reading database ... 5%
(Reading database ... 10%
(Reading database ... 15%
(Reading database ... 20%
(Reading database ... 25%
(Reading database ... 30%
(Reading database ... 35%
(Reading database ... 40%
(Reading database ... 45%
(Reading database ... 50%
(Reading database ... 55%
(Reading database ... 60%
(Reading database ... 65%
(Reading database ... 70%
(Reading database ... 75%
(Reading database ... 80%
(Reading database ... 85%
(Reading database ... 90%
(Reading database ... 95%
(Reading database ... 100%
(Reading database ... 24979 files and directories currently installed.)
Preparing to unpack .../libgssapi-krb5-2_1.17-ok4_rv64g.deb ...
Unpacking libgssapi-krb5-2:rv64g (1.17-ok4) over (1.17-ok3) ...
Setting up libgssapi-krb5-2:rv64g (1.17-ok4) ...
(Reading database ... 
(Reading database ... 5%
(Reading database ... 10%
(Reading database ... 15%
(Reading database ... 20%
(Reading database ... 25%
(Reading database ... 30%
(Reading database ... 35%
(Reading database ... 40%
(Reading database ... 45%
(Reading database ... 50%
(Reading database ... 55%
(Reading database ... 60%
(Reading database ... 65%
(Reading database ... 70%
(Reading database ... 75%
(Reading database ... 80%
(Reading database ... 85%
(Reading database ... 90%
(Reading database ... 95%
(Reading database ... 100%
(Reading database ... 24979 files and directories currently installed.)
Preparing to unpack .../libkeyutils1_1.6-ok3_rv64g.deb ...
Unpacking libkeyutils1:rv64g (1.6-ok3) over (1.6-ok2) ...
Setting up libkeyutils1:rv64g (1.6-ok3) ...
(Reading database ... 
(Reading database ... 5%
(Reading database ... 10%
(Reading database ... 15%
(Reading database ... 20%
(Reading database ... 25%
(Reading database ... 30%
(Reading database ... 35%
(Reading database ... 40%
(Reading database ... 45%
(Reading database ... 50%
(Reading database ... 55%
(Reading database ... 60%
(Reading database ... 65%
(Reading database ... 70%
(Reading database ... 75%
(Reading database ... 80%
(Reading database ... 85%
(Reading database ... 90%
(Reading database ... 95%
(Reading database ... 100%
(Reading database ... 24979 files and directories currently installed.)
Preparing to unpack .../libpcre2-8-0_10.34-ok2_rv64g.deb ...
Unpacking libpcre2-8-0:rv64g (10.34-ok2) over (10.34-ok2) ...
Setting up libpcre2-8-0:rv64g (10.34-ok2) ...
(Reading database ... 
(Reading database ... 5%
(Reading database ... 10%
(Reading database ... 15%
(Reading database ... 20%
(Reading database ... 25%
(Reading database ... 30%
(Reading database ... 35%
(Reading database ... 40%
(Reading database ... 45%
(Reading database ... 50%
(Reading database ... 55%
(Reading database ... 60%
(Reading database ... 65%
(Reading database ... 70%
(Reading database ... 75%
(Reading database ... 80%
(Reading database ... 85%
(Reading database ... 90%
(Reading database ... 95%
(Reading database ... 100%
(Reading database ... 24979 files and directories currently installed.)
Preparing to unpack .../libncursesw6_6.2-ok4_rv64g.deb ...
Unpacking libncursesw6:rv64g (6.2-ok4) over (6.2-ok2) ...
Preparing to unpack .../libtinfo6_6.2-ok4_rv64g.deb ...
Unpacking libtinfo6:rv64g (6.2-ok4) over (6.2-ok2) ...
Setting up libtinfo6:rv64g (6.2-ok4) ...
(Reading database ... 
(Reading database ... 5%
(Reading database ... 10%
(Reading database ... 15%
(Reading database ... 20%
(Reading database ... 25%
(Reading database ... 30%
(Reading database ... 35%
(Reading database ... 40%
(Reading database ... 45%
(Reading database ... 50%
(Reading database ... 55%
(Reading database ... 60%
(Reading database ... 65%
(Reading database ... 70%
(Reading database ... 75%
(Reading database ... 80%
(Reading database ... 85%
(Reading database ... 90%
(Reading database ... 95%
(Reading database ... 100%
(Reading database ... 24978 files and directories currently installed.)
Preparing to unpack .../00-libtext-iconv-perl_1.7-ok1_rv64g.deb ...
Unpacking libtext-iconv-perl (1.7-ok1) over (1.7-ok1) ...
Preparing to unpack .../01-tzdata_2019c-ok1_all.deb ...
Unpacking tzdata (2019c-ok1) over (2019c-ok1) ...
Preparing to unpack .../02-readline-common_8.0-ok2_all.deb ...
Unpacking readline-common (8.0-ok2) over (8.0-ok1) ...
Preparing to unpack .../03-libreadline8_8.0-ok2_rv64g.deb ...
Unpacking libreadline8:rv64g (8.0-ok2) over (8.0-ok1) ...
Preparing to unpack .../04-xz-utils_5.2.4-ok6_rv64g.deb ...
Unpacking xz-utils (5.2.4-ok6) over (5.2.4-ok4) ...
Preparing to unpack .../05-dpkg-dev_1.21.1-ok6.1_all.deb ...
Unpacking dpkg-dev (1.21.1-ok6.1) over (1.21.1-ok6) ...
Preparing to unpack .../06-libdpkg-perl_1.21.1-ok6.1_all.deb ...
Unpacking libdpkg-perl (1.21.1-ok6.1) over (1.21.1-ok6) ...
Preparing to unpack .../07-dselect_1.21.1-ok6.6_rv64g.deb ...
Unpacking dselect (1.21.1-ok6.6) over (1.21.1-ok6) ...
Preparing to unpack .../08-java-common_0.72-ok4_all.deb ...
Unpacking java-common (0.72-ok4) over (0.72-ok3) ...
Preparing to unpack .../09-libasan8_12.2.0-ok7_rv64g.deb ...
Unpacking libasan8:rv64g (12.2.0-ok7) over (12.2.0-ok7) ...
Preparing to unpack .../10-libatomic1_12.2.0-ok7_rv64g.deb ...
Unpacking libatomic1:rv64g (12.2.0-ok7) over (12.2.0-ok7) ...
Preparing to unpack .../11-libcc1-0_12.2.0-ok7_rv64g.deb ...
Unpacking libcc1-0:rv64g (12.2.0-ok7) over (12.2.0-ok7) ...
Preparing to unpack .../12-libcups2_2.4.2-ok4_rv64g.deb ...
Unpacking libcups2:rv64g (2.4.2-ok4) over (2.4.2-ok3) ...
Preparing to unpack .../13-zlib1g-dev_1%3a1.2.11.dfsg-ok3_rv64g.deb ...
Unpacking zlib1g-dev:rv64g (1:1.2.11.dfsg-ok3) over (1:1.2.11.dfsg-ok3) ...
Preparing to unpack .../14-libdpkg-dev_1.21.1-ok6.6_rv64g.deb ...
Unpacking libdpkg-dev:rv64g (1.21.1-ok6.6) over (1.21.1-ok6) ...
Preparing to unpack .../15-libfontconfig1_2.13.1-ok1_rv64g.deb ...
Unpacking libfontconfig1:rv64g (2.13.1-ok1) over (2.13.1-ok1) ...
Preparing to unpack .../16-libgomp1_12.2.0-ok7_rv64g.deb ...
Unpacking libgomp1:rv64g (12.2.0-ok7) over (12.2.0-ok7) ...
Preparing to unpack .../17-libgcc-12-dev_12.2.0-ok7_rv64g.deb ...
Unpacking libgcc-12-dev:rv64g (12.2.0-ok7) over (12.2.0-ok7) ...
Preparing to unpack .../18-libgfortran5_12.2.0-ok7_rv64g.deb ...
Unpacking libgfortran5:rv64g (12.2.0-ok7) over (12.2.0-ok7) ...
Preparing to unpack .../19-libgmpxx4ldbl_2%3a6.2.0+dfsg-ok3_rv64g.deb ...
Unpacking libgmpxx4ldbl:rv64g (2:6.2.0+dfsg-ok3) over (2:6.2.0+dfsg-ok3) ...
Preparing to unpack .../20-libgmp-dev_2%3a6.2.0+dfsg-ok3_rv64g.deb ...
Unpacking libgmp-dev:rv64g (2:6.2.0+dfsg-ok3) over (2:6.2.0+dfsg-ok3) ...
Preparing to unpack .../21-libjbig0_2.1-ok3_rv64g.deb ...
Unpacking libjbig0:rv64g (2.1-ok3) over (2.1-ok3) ...
Preparing to unpack .../22-libjpeg-turbo8_2.1.2-0ubuntu1_rv64g.deb ...
Unpacking libjpeg-turbo8:rv64g (2.1.2-0ubuntu1) over (2.0.3-ok0) ...
Preparing to unpack .../23-libjpeg62-turbo_1%3a2.1.2-ok2_rv64g.deb ...
Unpacking libjpeg62-turbo:rv64g (1:2.1.2-ok2) over (1:2.1.2-ok2) ...
Preparing to unpack .../24-libsqlite3-0_3.39.4-ok4_rv64g.deb ...
Unpacking libsqlite3-0:rv64g (3.39.4-ok4) over (3.39.4-ok3) ...
Preparing to unpack .../25-libnss3_2%3a3.49.1-ok5_rv64g.deb ...
Unpacking libnss3:rv64g (2:3.49.1-ok5) over (2:3.49.1-ok4) ...
Preparing to unpack .../26-libobjc4_12.2.0-ok7_rv64g.deb ...
Unpacking libobjc4:rv64g (12.2.0-ok7) over (12.2.0-ok7) ...
Preparing to unpack .../27-libpcsclite1_1.8.26-ok2.1_rv64g.deb ...
Unpacking libpcsclite1:rv64g (1.8.26-ok2.1) over (1.8.26-ok2) ...
Preparing to unpack .../28-libseccomp2_2.5.3-ok2_rv64g.deb ...
Unpacking libseccomp2:rv64g (2.5.3-ok2) over (2.5.3-ok1) ...
Preparing to unpack .../29-libwebp7_1.2.2-ok4_rv64g.deb ...
Unpacking libwebp7:rv64g (1.2.2-ok4) over (1.2.2-ok3) ...
Preparing to unpack .../30-libtiff5_4.1.0+git191117-ok3_rv64g.deb ...
Unpacking libtiff5:rv64g (4.1.0+git191117-ok3) over (4.1.0+git191117-ok2) ...
Preparing to unpack .../31-libxcb1_1.14-ok2_rv64g.deb ...
Unpacking libxcb1:rv64g (1.14-ok2) over (1.14-ok1) ...
Preparing to unpack .../32-libxi6_2%3a1.8-ok3_rv64g.deb ...
Unpacking libxi6:rv64g (2:1.8-ok3) over (2:1.8-ok2) ...
Preparing to unpack .../33-locales-all_2.36-ok6_rv64g.deb ...
Unpacking locales-all (2.36-ok6) over (2.36-ok2) ...
Preparing to unpack .../34-nscd_2.36-ok6_rv64g.deb ...
Unpacking nscd (2.36-ok6) over (2.36-ok2) ...
Preparing to unpack .../35-openssl_3.0.8-ok4.1_rv64g.deb ...
Unpacking openssl (3.0.8-ok4.1) over (3.0.8-ok3) ...
Preparing to unpack .../36-pkgbinarymangler_150-ok1_all.deb ...
Unpacking pkgbinarymangler (150-ok1) over (149-ok4) ...
Setting up libexpat1:rv64g (2.2.9-ok4) ...
Setting up libtext-iconv-perl (1.7-ok1) ...
Setting up libxcb1:rv64g (1.14-ok2) ...
Setting up apt-utils (2.5.4-ok6.2) ...
Setting up perl-modules-5.30 (5.30.0-ok6) ...
Setting up pkgbinarymangler (150-ok1) ...
Setting up libxi6:rv64g (2:1.8-ok3) ...
Setting up java-common (0.72-ok4) ...
Setting up libc6-prof:rv64g (2.36-ok6) ...
Setting up libsqlite3-0:rv64g (3.39.4-ok4) ...
Setting up libobjc4:rv64g (12.2.0-ok7) ...
Setting up libnss3:rv64g (2:3.49.1-ok5) ...
Setting up libapt-pkg-dev:rv64g (2.5.4-ok6.2) ...
Setting up libgomp1:rv64g (12.2.0-ok7) ...
Setting up libjbig0:rv64g (2.1-ok3) ...
Setting up locales-all (2.36-ok6) ...
Setting up libseccomp2:rv64g (2.5.3-ok2) ...
Setting up tzdata (2019c-ok1) ...

Current default time zone: 'Etc/UTC'
Local time is now:      Tue Mar 18 07:38:24 UTC 2025.
Universal Time is now:  Tue Mar 18 07:38:24 UTC 2025.
Run 'dpkg-reconfigure tzdata' if you wish to change it.

Setting up libgmpxx4ldbl:rv64g (2:6.2.0+dfsg-ok3) ...
Setting up libjpeg62-turbo:rv64g (1:2.1.2-ok2) ...
Setting up libdbus-1-3:rv64g (1.14.6-ok2) ...
Setting up xz-utils (5.2.4-ok6) ...
Setting up libatomic1:rv64g (12.2.0-ok7) ...
Setting up libsystemd-shared:rv64g (251.4-ok1.7) ...
Setting up nscd (2.36-ok6) ...
Running in chroot, ignoring request.
Setting up libpcsclite1:rv64g (1.8.26-ok2.1) ...
Setting up libncursesw6:rv64g (6.2-ok4) ...
Setting up libjpeg-turbo8:rv64g (2.1.2-0ubuntu1) ...
Setting up libgfortran5:rv64g (12.2.0-ok7) ...
Setting up libwebp7:rv64g (1.2.2-ok4) ...
Setting up liblzma-dev:rv64g (5.2.4-ok6) ...
Setting up libcups2:rv64g (2.4.2-ok4) ...
Setting up libdevmapper1.02.1:rv64g (2:1.02.167-ok3) ...
Setting up mount (2.38.1-ok5build1) ...
Setting up libcrypt-dev:rv64g (1:4.4.10-ok3.1) ...
Setting up dbus-session-bus-common (1.14.6-ok2) ...
Setting up libasan8:rv64g (12.2.0-ok7) ...
Setting up libperl5.30:rv64g (5.30.0-ok6) ...
Setting up libcryptsetup12:rv64g (2:2.2.2-ok6) ...
Setting up libtiff5:rv64g (4.1.0+git191117-ok3) ...
Setting up libfontconfig1:rv64g (2.13.1-ok1) ...
Setting up dbus-system-bus-common (1.14.6-ok2) ...
Setting up libc-dev-bin (2.36-ok6) ...
Setting up openssl (3.0.8-ok4.1) ...
Setting up readline-common (8.0-ok2) ...
Setting up libcc1-0:rv64g (12.2.0-ok7) ...
Setting up dbus-bin (1.14.6-ok2) ...
Setting up liblocale-gettext-perl (1.07-ok1) ...
Setting up libc-devtools (2.36-ok6) ...
Setting up libgmp-dev:rv64g (2:6.2.0+dfsg-ok3) ...
Setting up libreadline8:rv64g (8.0-ok2) ...
Setting up systemd (251.4-ok1.7) ...
Installing new version of config file /etc/systemd/system.conf ...
Installing new version of config file /etc/systemd/user.conf ...
Initializing machine ID from D-Bus machine ID.
Setting up dbus-daemon (1.14.6-ok2) ...
Setting up dselect (1.21.1-ok6.6) ...
Setting up perl (5.30.0-ok6) ...
Setting up dbus (1.14.6-ok2) ...
Running in chroot, ignoring request.
Setting up libgcc-12-dev:rv64g (12.2.0-ok7) ...
Setting up systemd-timesyncd (251.4-ok1.7) ...
Setting up libdpkg-perl (1.21.1-ok6.1) ...
Setting up libc6-dev:rv64g (2.36-ok6) ...
Setting up systemd-sysv (251.4-ok1.7) ...
Setting up dpkg-dev (1.21.1-ok6.1) ...
Setting up zlib1g-dev:rv64g (1:1.2.11.dfsg-ok3) ...
Setting up libdpkg-dev:rv64g (1.21.1-ok6.6) ...
Processing triggers for libc-bin (2.36-ok6) ...
RUN: /usr/share/launchpad-buildd/bin/sbuild-package PACKAGEBUILD-288505 rv64g yangtze -c chroot:build-PACKAGEBUILD-288505 --arch=rv64g --dist=yangtze --nolog libkylin-chkname_1.0.10kylin3uk1-0k2.dsc
Initiating build PACKAGEBUILD-288505 with 48 jobs across 48 processor cores.
Kernel reported to sbuild: 5.15.0-88-generic #98-Ubuntu SMP Mon Oct 2 15:18:56 UTC 2023 riscv64
sbuild (Debian sbuild) 0.67.0 (26 Dec 2015) on 02a0ff1f52c3

+==============================================================================+
| libkylin-chkname 1.0.10kylin3uk1-0k2 (rv64g)               18 Mar 2025 15:38 |
+==============================================================================+

Package: libkylin-chkname
Version: 1.0.10kylin3uk1-0k2
Source Version: 1.0.10kylin3uk1-0k2
Distribution: yangtze
Machine Architecture: riscv64
Host Architecture: rv64g
Build Architecture: rv64g

I: NOTICE: Log filtering will replace 'build/libkylin-chkname-plaSem/libkylin-chkname-1.0.10kylin3uk1' with '<<PKGBUILDDIR>>'
I: NOTICE: Log filtering will replace 'build/libkylin-chkname-plaSem' with '<<BUILDDIR>>'
I: NOTICE: Log filtering will replace 'home/buildd/build-PACKAGEBUILD-288505/chroot-autobuild' with '<<CHROOT>>'

+------------------------------------------------------------------------------+
| Fetch source files                                                           |
+------------------------------------------------------------------------------+


Local sources
-------------

libkylin-chkname_1.0.10kylin3uk1-0k2.dsc exists in .; copying to chroot

Check architectures
-------------------

Initial Foreign Architectures: riscv64 

Check dependencies
------------------

Merged Build-Depends: build-essential, fakeroot
Filtered Build-Depends: build-essential, fakeroot
dpkg-deb: building package 'sbuild-build-depends-core-dummy' in '/<<BUILDDIR>>/resolver-Z0g0po/apt_archive/sbuild-build-depends-core-dummy.deb'.
Ign:1 copy:/<<BUILDDIR>>/resolver-Z0g0po/apt_archive ./ InRelease
Get:2 copy:/<<BUILDDIR>>/resolver-Z0g0po/apt_archive ./ Release [2121 B]
Ign:3 copy:/<<BUILDDIR>>/resolver-Z0g0po/apt_archive ./ Release.gpg
Get:4 copy:/<<BUILDDIR>>/resolver-Z0g0po/apt_archive ./ Sources [214 B]
Get:5 copy:/<<BUILDDIR>>/resolver-Z0g0po/apt_archive ./ Packages [527 B]
Fetched 2862 B in 0s (9197 B/s)
Reading package lists...
Reading package lists...

+------------------------------------------------------------------------------+
| Install core build dependencies (apt-based resolver)                         |
+------------------------------------------------------------------------------+

Installing build dependencies
Reading package lists...
Building dependency tree...
Reading state information...
The following additional packages will be installed:
  build-essential g++ gcc
Suggested packages:
  autoconf automake bison flex gcc-doc gcc-multilib gdb libtool manpages-dev
The following NEW packages will be installed:
  build-essential g++ gcc sbuild-build-depends-core-dummy
0 upgraded, 4 newly installed, 0 to remove and 0 not upgraded.
Need to get 11.0 kB of archives.
After this operation, 78.8 kB of additional disk space will be used.
Get:1 copy:/<<BUILDDIR>>/resolver-Z0g0po/apt_archive ./ sbuild-build-depends-core-dummy 0.invalid.0 [644 B]
Get:2 http://archive.build.openkylin.top/openkylin yangtze/main rv64g gcc rv64g 4:9.3.0-ok7 [5128 B]
Get:3 http://archive.build.openkylin.top/openkylin yangtze/main rv64g g++ rv64g 4:9.3.0-ok7 [1432 B]
Get:4 http://archive.build.openkylin.top/openkylin yangtze/main rv64g build-essential rv64g 12.8-ok1 [3802 B]
Fetched 11.0 kB in 1s (19.1 kB/s)
Selecting previously unselected package gcc.
(Reading database ... 
(Reading database ... 5%
(Reading database ... 10%
(Reading database ... 15%
(Reading database ... 20%
(Reading database ... 25%
(Reading database ... 30%
(Reading database ... 35%
(Reading database ... 40%
(Reading database ... 45%
(Reading database ... 50%
(Reading database ... 55%
(Reading database ... 60%
(Reading database ... 65%
(Reading database ... 70%
(Reading database ... 75%
(Reading database ... 80%
(Reading database ... 85%
(Reading database ... 90%
(Reading database ... 95%
(Reading database ... 100%
(Reading database ... 24979 files and directories currently installed.)
Preparing to unpack .../gcc_4%3a9.3.0-ok7_rv64g.deb ...
Unpacking gcc (4:9.3.0-ok7) ...
Selecting previously unselected package g++.
Preparing to unpack .../g++_4%3a9.3.0-ok7_rv64g.deb ...
Unpacking g++ (4:9.3.0-ok7) ...
Selecting previously unselected package build-essential.
Preparing to unpack .../build-essential_12.8-ok1_rv64g.deb ...
Unpacking build-essential (12.8-ok1) ...
Selecting previously unselected package sbuild-build-depends-core-dummy.
Preparing to unpack .../sbuild-build-depends-core-dummy_0.invalid.0_rv64g.deb ...
Unpacking sbuild-build-depends-core-dummy (0.invalid.0) ...
Setting up gcc (4:9.3.0-ok7) ...
Setting up g++ (4:9.3.0-ok7) ...
update-alternatives: using /usr/bin/g++ to provide /usr/bin/c++ (c++) in auto mode
Setting up build-essential (12.8-ok1) ...
Setting up sbuild-build-depends-core-dummy (0.invalid.0) ...
Merged Build-Depends: autotools-dev, debhelper-compat (= 12)
Filtered Build-Depends: autotools-dev, debhelper-compat (= 12)
dpkg-deb: building package 'sbuild-build-depends-libkylin-chkname-dummy' in '/<<BUILDDIR>>/resolver-pzC4iF/apt_archive/sbuild-build-depends-libkylin-chkname-dummy.deb'.
Ign:1 copy:/<<BUILDDIR>>/resolver-pzC4iF/apt_archive ./ InRelease
Get:2 copy:/<<BUILDDIR>>/resolver-pzC4iF/apt_archive ./ Release [2121 B]
Ign:3 copy:/<<BUILDDIR>>/resolver-pzC4iF/apt_archive ./ Release.gpg
Get:4 copy:/<<BUILDDIR>>/resolver-pzC4iF/apt_archive ./ Sources [227 B]
Get:5 copy:/<<BUILDDIR>>/resolver-pzC4iF/apt_archive ./ Packages [545 B]
Fetched 2893 B in 0s (9078 B/s)
Reading package lists...
Reading package lists...

+------------------------------------------------------------------------------+
| Install libkylin-chkname build dependencies (apt-based resolver)             |
+------------------------------------------------------------------------------+

Installing build dependencies
Reading package lists...
Building dependency tree...
Reading state information...
The following additional packages will be installed:
  autoconf automake autopoint autotools-dev bsdextrautils bsdmainutils
  debhelper debugedit dh-autoreconf dh-strip-nondeterminism dwz file gettext
  gettext-base groff-base intltool-debian libarchive-zip-perl
  libdebhelper-perl libdw1 libelf1 libfile-stripnondeterminism-perl libicu66
  libmagic-mgc libmagic1 libpipeline1 libsigsegv2 libsub-override-perl libtool
  libuchardet0 libxml2 m4 man-db ncal po-debconf
Suggested packages:
  autoconf-archive gnu-standards autoconf-doc calendar whois vacation
  mailutils dh-make gettext-doc libasprintf-dev libgettextpo-dev groff
  libtool-doc gfortran | fortran95-compiler gcj-jdk m4-doc apparmor less
  www-browser libmail-box-perl
Recommended packages:
  curl | wget | lynx libarchive-cpio-perl libltdl-dev libmail-sendmail-perl
The following NEW packages will be installed:
  autoconf automake autopoint autotools-dev bsdextrautils bsdmainutils
  debhelper debugedit dh-autoreconf dh-strip-nondeterminism dwz file gettext
  gettext-base groff-base intltool-debian libarchive-zip-perl
  libdebhelper-perl libdw1 libelf1 libfile-stripnondeterminism-perl libicu66
  libmagic-mgc libmagic1 libpipeline1 libsigsegv2 libsub-override-perl libtool
  libuchardet0 libxml2 m4 man-db ncal po-debconf
  sbuild-build-depends-libkylin-chkname-dummy
0 upgraded, 35 newly installed, 0 to remove and 0 not upgraded.
Need to get 18.0 MB of archives.
After this operation, 66.9 MB of additional disk space will be used.
Get:1 copy:/<<BUILDDIR>>/resolver-pzC4iF/apt_archive ./ sbuild-build-depends-libkylin-chkname-dummy 0.invalid.0 [674 B]
Get:2 http://archive.build.openkylin.top/openkylin yangtze/main rv64g bsdextrautils rv64g 2.38.1-ok5build1 [82.2 kB]
Get:3 http://archive.build.openkylin.top/openkylin yangtze/main rv64g ncal rv64g 12.1.7-ok1 [17.5 kB]
Get:4 http://archive.build.openkylin.top/openkylin yangtze/main rv64g bsdmainutils all 12.1.7-ok1 [5046 B]
Get:5 http://archive.build.openkylin.top/openkylin yangtze/main rv64g libuchardet0 rv64g 0.0.6-ok1 [71.5 kB]
Get:6 http://archive.build.openkylin.top/openkylin yangtze/main rv64g groff-base rv64g 1.22.4-ok3 [914 kB]
Get:7 http://archive.build.openkylin.top/openkylin yangtze/main rv64g libpipeline1 rv64g 1.5.3-ok1 [46.5 kB]
Get:8 http://archive.build.openkylin.top/openkylin yangtze/main rv64g man-db rv64g 2.9.1-ok3 [1249 kB]
Get:9 http://archive.build.openkylin.top/openkylin yangtze/main rv64g libmagic-mgc rv64g 1:5.38-ok1 [241 kB]
Get:10 http://archive.build.openkylin.top/openkylin yangtze/main rv64g libmagic1 rv64g 1:5.38-ok1 [92.6 kB]
Get:11 http://archive.build.openkylin.top/openkylin yangtze/main rv64g file rv64g 1:5.38-ok1 [41.3 kB]
Get:12 http://archive.build.openkylin.top/OTHER/Internal-mirror/stage0 yangtze/main rv64g gettext-base rv64g 0.21-4-ok6 [81.3 kB]
Get:13 http://archive.build.openkylin.top/openkylin yangtze/main rv64g libsigsegv2 rv64g 2.12-ok1 [29.0 kB]
Get:14 http://archive.build.openkylin.top/openkylin yangtze/main rv64g m4 rv64g 1.4.18-ok3 [190 kB]
Get:15 http://archive.build.openkylin.top/openkylin yangtze/main rv64g autoconf all 2.71-ok2 [390 kB]
Get:16 http://archive.build.openkylin.top/openkylin yangtze/main rv64g autotools-dev all 20220506-ok1 [41.6 kB]
Get:17 http://archive.build.openkylin.top/openkylin yangtze/main rv64g automake all 1:1.16.5-ok1 [557 kB]
Get:18 http://archive.build.openkylin.top/openkylin yangtze/main rv64g autopoint all 0.21-4-ok6 [419 kB]
Get:19 http://archive.build.openkylin.top/openkylin yangtze/main rv64g libdebhelper-perl all 13.11.4-ok1 [63.6 kB]
Get:20 http://archive.build.openkylin.top/openkylin yangtze/main rv64g libtool all 2.4.7-ok3 [165 kB]
Get:21 http://archive.build.openkylin.top/openkylin yangtze/main rv64g dh-autoreconf all 20-ok1 [16.3 kB]
Get:22 http://archive.build.openkylin.top/openkylin yangtze/main rv64g libarchive-zip-perl all 1.68-ok1 [90.7 kB]
Get:23 http://archive.build.openkylin.top/openkylin yangtze/main rv64g libsub-override-perl all 0.09-ok2 [8374 B]
Get:24 http://archive.build.openkylin.top/openkylin yangtze/main rv64g libfile-stripnondeterminism-perl all 1.13.0-ok1 [16.8 kB]
Get:25 http://archive.build.openkylin.top/openkylin yangtze/main rv64g dh-strip-nondeterminism all 1.13.0-ok1 [5334 B]
Get:26 http://archive.build.openkylin.top/openkylin yangtze/main rv64g libelf1 rv64g 0.187-ok1 [179 kB]
Get:27 http://archive.build.openkylin.top/openkylin yangtze/main rv64g libdw1 rv64g 0.187-ok1 [204 kB]
Get:28 http://archive.build.openkylin.top/openkylin yangtze/main rv64g debugedit rv64g 1:5.0-ok1 [65.2 kB]
Get:29 http://archive.build.openkylin.top/openkylin yangtze/main rv64g dwz rv64g 0.15-1ok1 [104 kB]
Get:30 http://archive.build.openkylin.top/openkylin yangtze/main rv64g libicu66 rv64g 66.1-ok4 [9742 kB]
Get:31 http://archive.build.openkylin.top/OTHER/Internal-mirror/rv64g-stage0 yangtze/main rv64g libxml2 rv64g 2.9.14+dfsg-1.1build2 [539 kB]
Get:32 http://archive.build.openkylin.top/OTHER/Internal-mirror/stage0 yangtze/main rv64g gettext rv64g 0.21-4-ok6 [1112 kB]
Get:33 http://archive.build.openkylin.top/openkylin yangtze/main rv64g intltool-debian all 0.35.0+20060710.5-ok2 [23.2 kB]
Get:34 http://archive.build.openkylin.top/openkylin yangtze/main rv64g po-debconf all 1.0.21+nmu1-ok1 [227 kB]
Get:35 http://archive.build.openkylin.top/openkylin yangtze/main rv64g debhelper all 13.11.4-ok1 [924 kB]
Preconfiguring packages ...
Fetched 18.0 MB in 22s (805 kB/s)
Selecting previously unselected package bsdextrautils.
(Reading database ... 
(Reading database ... 5%
(Reading database ... 10%
(Reading database ... 15%
(Reading database ... 20%
(Reading database ... 25%
(Reading database ... 30%
(Reading database ... 35%
(Reading database ... 40%
(Reading database ... 45%
(Reading database ... 50%
(Reading database ... 55%
(Reading database ... 60%
(Reading database ... 65%
(Reading database ... 70%
(Reading database ... 75%
(Reading database ... 80%
(Reading database ... 85%
(Reading database ... 90%
(Reading database ... 95%
(Reading database ... 100%
(Reading database ... 25021 files and directories currently installed.)
Preparing to unpack .../00-bsdextrautils_2.38.1-ok5build1_rv64g.deb ...
Unpacking bsdextrautils (2.38.1-ok5build1) ...
Selecting previously unselected package ncal.
Preparing to unpack .../01-ncal_12.1.7-ok1_rv64g.deb ...
Unpacking ncal (12.1.7-ok1) ...
Selecting previously unselected package bsdmainutils.
Preparing to unpack .../02-bsdmainutils_12.1.7-ok1_all.deb ...
Unpacking bsdmainutils (12.1.7-ok1) ...
Selecting previously unselected package libuchardet0:rv64g.
Preparing to unpack .../03-libuchardet0_0.0.6-ok1_rv64g.deb ...
Unpacking libuchardet0:rv64g (0.0.6-ok1) ...
Selecting previously unselected package groff-base.
Preparing to unpack .../04-groff-base_1.22.4-ok3_rv64g.deb ...
Unpacking groff-base (1.22.4-ok3) ...
Selecting previously unselected package libpipeline1:rv64g.
Preparing to unpack .../05-libpipeline1_1.5.3-ok1_rv64g.deb ...
Unpacking libpipeline1:rv64g (1.5.3-ok1) ...
Selecting previously unselected package man-db.
Preparing to unpack .../06-man-db_2.9.1-ok3_rv64g.deb ...
Unpacking man-db (2.9.1-ok3) ...
Selecting previously unselected package libmagic-mgc.
Preparing to unpack .../07-libmagic-mgc_1%3a5.38-ok1_rv64g.deb ...
Unpacking libmagic-mgc (1:5.38-ok1) ...
Selecting previously unselected package libmagic1:rv64g.
Preparing to unpack .../08-libmagic1_1%3a5.38-ok1_rv64g.deb ...
Unpacking libmagic1:rv64g (1:5.38-ok1) ...
Selecting previously unselected package file.
Preparing to unpack .../09-file_1%3a5.38-ok1_rv64g.deb ...
Unpacking file (1:5.38-ok1) ...
Selecting previously unselected package gettext-base.
Preparing to unpack .../10-gettext-base_0.21-4-ok6_rv64g.deb ...
Unpacking gettext-base (0.21-4-ok6) ...
Selecting previously unselected package libsigsegv2:rv64g.
Preparing to unpack .../11-libsigsegv2_2.12-ok1_rv64g.deb ...
Unpacking libsigsegv2:rv64g (2.12-ok1) ...
Selecting previously unselected package m4.
Preparing to unpack .../12-m4_1.4.18-ok3_rv64g.deb ...
Unpacking m4 (1.4.18-ok3) ...
Selecting previously unselected package autoconf.
Preparing to unpack .../13-autoconf_2.71-ok2_all.deb ...
Unpacking autoconf (2.71-ok2) ...
Selecting previously unselected package autotools-dev.
Preparing to unpack .../14-autotools-dev_20220506-ok1_all.deb ...
Unpacking autotools-dev (20220506-ok1) ...
Selecting previously unselected package automake.
Preparing to unpack .../15-automake_1%3a1.16.5-ok1_all.deb ...
Unpacking automake (1:1.16.5-ok1) ...
Selecting previously unselected package autopoint.
Preparing to unpack .../16-autopoint_0.21-4-ok6_all.deb ...
Unpacking autopoint (0.21-4-ok6) ...
Selecting previously unselected package libdebhelper-perl.
Preparing to unpack .../17-libdebhelper-perl_13.11.4-ok1_all.deb ...
Unpacking libdebhelper-perl (13.11.4-ok1) ...
Selecting previously unselected package libtool.
Preparing to unpack .../18-libtool_2.4.7-ok3_all.deb ...
Unpacking libtool (2.4.7-ok3) ...
Selecting previously unselected package dh-autoreconf.
Preparing to unpack .../19-dh-autoreconf_20-ok1_all.deb ...
Unpacking dh-autoreconf (20-ok1) ...
Selecting previously unselected package libarchive-zip-perl.
Preparing to unpack .../20-libarchive-zip-perl_1.68-ok1_all.deb ...
Unpacking libarchive-zip-perl (1.68-ok1) ...
Selecting previously unselected package libsub-override-perl.
Preparing to unpack .../21-libsub-override-perl_0.09-ok2_all.deb ...
Unpacking libsub-override-perl (0.09-ok2) ...
Selecting previously unselected package libfile-stripnondeterminism-perl.
Preparing to unpack .../22-libfile-stripnondeterminism-perl_1.13.0-ok1_all.deb ...
Unpacking libfile-stripnondeterminism-perl (1.13.0-ok1) ...
Selecting previously unselected package dh-strip-nondeterminism.
Preparing to unpack .../23-dh-strip-nondeterminism_1.13.0-ok1_all.deb ...
Unpacking dh-strip-nondeterminism (1.13.0-ok1) ...
Selecting previously unselected package libelf1:rv64g.
Preparing to unpack .../24-libelf1_0.187-ok1_rv64g.deb ...
Unpacking libelf1:rv64g (0.187-ok1) ...
Selecting previously unselected package libdw1:rv64g.
Preparing to unpack .../25-libdw1_0.187-ok1_rv64g.deb ...
Unpacking libdw1:rv64g (0.187-ok1) ...
Selecting previously unselected package debugedit.
Preparing to unpack .../26-debugedit_1%3a5.0-ok1_rv64g.deb ...
Unpacking debugedit (1:5.0-ok1) ...
Selecting previously unselected package dwz.
Preparing to unpack .../27-dwz_0.15-1ok1_rv64g.deb ...
Unpacking dwz (0.15-1ok1) ...
Selecting previously unselected package libicu66:rv64g.
Preparing to unpack .../28-libicu66_66.1-ok4_rv64g.deb ...
Unpacking libicu66:rv64g (66.1-ok4) ...
Selecting previously unselected package libxml2:rv64g.
Preparing to unpack .../29-libxml2_2.9.14+dfsg-1.1build2_rv64g.deb ...
Unpacking libxml2:rv64g (2.9.14+dfsg-1.1build2) ...
Selecting previously unselected package gettext.
Preparing to unpack .../30-gettext_0.21-4-ok6_rv64g.deb ...
Unpacking gettext (0.21-4-ok6) ...
Selecting previously unselected package intltool-debian.
Preparing to unpack .../31-intltool-debian_0.35.0+20060710.5-ok2_all.deb ...
Unpacking intltool-debian (0.35.0+20060710.5-ok2) ...
Selecting previously unselected package po-debconf.
Preparing to unpack .../32-po-debconf_1.0.21+nmu1-ok1_all.deb ...
Unpacking po-debconf (1.0.21+nmu1-ok1) ...
Selecting previously unselected package debhelper.
Preparing to unpack .../33-debhelper_13.11.4-ok1_all.deb ...
Unpacking debhelper (13.11.4-ok1) ...
Selecting previously unselected package sbuild-build-depends-libkylin-chkname-dummy.
Preparing to unpack .../34-sbuild-build-depends-libkylin-chkname-dummy_0.invalid.0_rv64g.deb ...
Unpacking sbuild-build-depends-libkylin-chkname-dummy (0.invalid.0) ...
Setting up libpipeline1:rv64g (1.5.3-ok1) ...
Setting up bsdextrautils (2.38.1-ok5build1) ...
Setting up libmagic-mgc (1:5.38-ok1) ...
Setting up ncal (12.1.7-ok1) ...
Setting up libarchive-zip-perl (1.68-ok1) ...
Setting up libicu66:rv64g (66.1-ok4) ...
Setting up libdebhelper-perl (13.11.4-ok1) ...
Setting up libmagic1:rv64g (1:5.38-ok1) ...
Setting up gettext-base (0.21-4-ok6) ...
Setting up file (1:5.38-ok1) ...
Setting up autotools-dev (20220506-ok1) ...
Setting up libsigsegv2:rv64g (2.12-ok1) ...
Setting up bsdmainutils (12.1.7-ok1) ...
Setting up autopoint (0.21-4-ok6) ...
Setting up libuchardet0:rv64g (0.0.6-ok1) ...
Setting up libsub-override-perl (0.09-ok2) ...
Setting up libelf1:rv64g (0.187-ok1) ...
Setting up libxml2:rv64g (2.9.14+dfsg-1.1build2) ...
Setting up libfile-stripnondeterminism-perl (1.13.0-ok1) ...
Setting up libdw1:rv64g (0.187-ok1) ...
Setting up gettext (0.21-4-ok6) ...
Setting up libtool (2.4.7-ok3) ...
Setting up m4 (1.4.18-ok3) ...
Setting up intltool-debian (0.35.0+20060710.5-ok2) ...
Setting up autoconf (2.71-ok2) ...
Setting up dh-strip-nondeterminism (1.13.0-ok1) ...
Setting up dwz (0.15-1ok1) ...
Setting up groff-base (1.22.4-ok3) ...
Setting up debugedit (1:5.0-ok1) ...
Setting up automake (1:1.16.5-ok1) ...
update-alternatives: using /usr/bin/automake-1.16 to provide /usr/bin/automake (automake) in auto mode
Setting up po-debconf (1.0.21+nmu1-ok1) ...
Setting up man-db (2.9.1-ok3) ...
Not building database; man-db/auto-update is not 'true'.
Created symlink /etc/systemd/system/timers.target.wants/man-db.timer → /lib/systemd/system/man-db.timer.
Setting up dh-autoreconf (20-ok1) ...
Setting up debhelper (13.11.4-ok1) ...
Setting up sbuild-build-depends-libkylin-chkname-dummy (0.invalid.0) ...
Processing triggers for libc-bin (2.36-ok6) ...

+------------------------------------------------------------------------------+
| Build environment                                                            |
+------------------------------------------------------------------------------+

Kernel: Linux 5.15.0-88-generic riscv64 (riscv64)
Toolchain package versions: binutils_2.34-ok1 dpkg-dev_1.21.1-ok6.1 g++-9_9.3.0-ok12 gcc-9_9.3.0-ok12 libc6-dev_2.36-ok6 libstdc++-9-dev_9.3.0-ok12 libstdc++6_12.2.0-ok7 linux-libc-dev_6.2.0-23.23
Package versions: adduser_3.118-ok4 advancecomp_2.5-ok1 alsa-topology-conf_1.2.2-ok0 alsa-ucm-conf_1.2.2-ok3 apt_2.5.4-ok6.2 apt-utils_2.5.4-ok6.2 autoconf_2.71-ok2 automake_1:1.16.5-ok1 autopoint_0.21-4-ok6 autotools-dev_20220506-ok1 base-files_11-ok13.1 base-passwd_3.6.1 bash_5.0-ok4 binutils_2.34-ok1 binutils-common_2.34-ok1 binutils-dev_2.34-ok1 binutils-for-host_2.34-ok1 binutils-riscv64-linux-gnu_2.34-ok1 bsdextrautils_2.38.1-ok5build1 bsdmainutils_12.1.7-ok1 bsdutils_1:2.38.1-ok5build1 build-essential_12.8-ok1 bzip2_1.0.8.2-0k0 bzip2-doc_1.0.8.2-0k0 ca-certificates_20190110-ok1 ca-certificates-java_20190909-ok6 coreutils_8.30-ok4 cpp_4:9.3.0-ok7 cpp-9_9.3.0-ok12 dash_0.5.10.2-ok1 dbus_1.14.6-ok2 dbus-bin_1.14.6-ok2 dbus-daemon_1.14.6-ok2 dbus-session-bus-common_1.14.6-ok2 dbus-system-bus-common_1.14.6-ok2 debconf_1.5.73-ok1 debhelper_13.11.4-ok1 debianutils_4.9.1-ok1 debugedit_1:5.0-ok1 dh-autoreconf_20-ok1 dh-strip-nondeterminism_1.13.0-ok1 diffutils_1:3.7-ok2 dpkg_1.21.1-ok6.6 dpkg-dev_1.21.1-ok6.1 dselect_1.21.1-ok6.6 dwz_0.15-1ok1 e2fsprogs_1.45.5-ok1 fakeroot_1.30.1-ok2 file_1:5.38-ok1 findutils_4.7.0-ok1 fontconfig-config_2.13.1-ok1 fonts-dejavu-core_2.37-ok1 g++_4:9.3.0-ok7 g++-9_9.3.0-ok12 gcc_4:9.3.0-ok7 gcc-10-base_10.4.0-7ubuntu1 gcc-12-base_12.2.0-ok7 gcc-9_9.3.0-ok12 gcc-9-base_9.3.0-ok12 gettext_0.21-4-ok6 gettext-base_0.21-4-ok6 gnat-9_9.3.0-ok12 gpg_2.2.19-ok1 gpg-agent_2.2.19-ok1 gpgconf_2.2.19-ok1 gpgv_2.2.19-ok1 grep_3.4-ok3 groff-base_1.22.4-ok3 gzip_1.10-ok4 hostname_3.23-ok2 init_1.57-ok2 init-system-helpers_1.57-ok2 intltool-debian_0.35.0+20060710.5-ok2 java-common_0.72-ok4 libacl1_2.2.53-ok1 libapparmor1_2.13.3-ok1 libapt-pkg-dev_2.5.4-ok6.2 libapt-pkg6.0_2.5.4-ok6.2 libarchive-zip-perl_1.68-ok1 libargon2-1_0~20171227-ok1 libasan8_12.2.0-ok7 libasound2_1.2.2-ok3 libasound2-data_1.2.2-ok3 libassuan0_2.5.3-ok1 libatomic1_12.2.0-ok7 libattr1_1:2.4.48-ok1 libaudit-common_1:2.8.5-ok3.1 libaudit1_1:2.8.5-ok3.1 libavahi-client3_0.7-ok4 libavahi-common-data_0.7-ok4 libavahi-common3_0.7-ok4 libbinutils_2.34-ok1 libblkid1_2.38.1-ok5build1 libbsd0_0.10.0-ok1 libbz2-1.0_1.0.8.2-0k0 libbz2-dev_1.0.8.2-0k0 libc-bin_2.36-ok6 libc-dev-bin_2.36-ok6 libc-devtools_2.36-ok6 libc6_2.36-ok6 libc6-dev_2.36-ok6 libc6-prof_2.36-ok6 libcap-ng0_0.7.9-ok1 libcap2_1:2.32-ok1 libcc1-0_12.2.0-ok7 libcom-err2_1.45.5-ok1 libcrypt-dev_1:4.4.10-ok3.1 libcrypt1_1:4.4.10-ok3.1 libcryptsetup12_2:2.2.2-ok6 libctf-nobfd0_2.34-ok1 libctf0_2.34-ok1 libcups2_2.4.2-ok4 libdb5.3_5.3.28+dfsg1-ok1 libdbus-1-3_1.14.6-ok2 libdebconfclient0_0.251-ok2 libdebhelper-perl_13.11.4-ok1 libdevmapper1.02.1_2:1.02.167-ok3 libdpkg-dev_1.21.1-ok6.6 libdpkg-perl_1.21.1-ok6.1 libdw1_0.187-ok1 libelf1_0.187-ok1 libexpat1_2.2.9-ok4 libext2fs2_1.45.5-ok1 libfakeroot_1.30.1-ok2 libfdisk1_2.38.1-ok5build1 libffi7_3.3-ok1 libffi8_3.4.4-ok4 libfile-stripnondeterminism-perl_1.13.0-ok1 libfontconfig1_2.13.1-ok1 libfreetype6_2.10.1-ok1 libgc1c2_1:7.6.4-ok2 libgcc-12-dev_12.2.0-ok7 libgcc-9-dev_9.3.0-ok12 libgcc-s1_12.2.0-ok7 libgccjit-9-dev_9.3.0-ok12 libgccjit0_12.2.0-ok7 libgcrypt20_1.8.5-ok5 libgd3_2.2.5-ok7 libgdbm-compat4_1.18.1-ok2 libgdbm6_1.18.1-ok2 libgfortran5_12.2.0-ok7 libgmp-dev_2:6.2.0+dfsg-ok3 libgmp10_2:6.2.0+dfsg-ok3 libgmpxx4ldbl_2:6.2.0+dfsg-ok3 libgnat-9_9.3.0-ok12 libgnatvsn9_9.3.0-ok12 libgnutls30_3.6.13-ok12.1 libgomp1_12.2.0-ok7 libgpg-error0_1.37-ok1 libgpm2_1.20.7-ok1 libgssapi-krb5-2_1.17-ok4 libhogweed5_3.5.1+really3.5.1-ok3 libicu66_66.1-ok4 libidn2-0_2.2.0-ok2 libip4tc2_1.8.4-ok2 libisl23_0.25-ok1 libjansson4_2.12-ok1 libjbig0_2.1-ok3 libjpeg-turbo8_2.1.2-0ubuntu1 libjpeg62-turbo_1:2.1.2-ok2 libjpeg8_8c-ok2 libjson-c4_0.13.1+dfsg-ok1 libk5crypto3_1.17-ok4 libkeyutils1_1.6-ok3 libkmod2_27-ok2.1 libkrb5-3_1.17-ok4 libkrb5support0_1.17-ok4 liblcms2-2_2.9-ok1 liblocale-gettext-perl_1.07-ok1 liblockfile-bin_1.17-ok1 liblockfile1_1.17-ok1 liblz4-1_1.9.2-ok3 liblzma-dev_5.2.4-ok6 liblzma5_5.2.4-ok6 libmagic-mgc_1:5.38-ok1 libmagic1_1:5.38-ok1 libmount1_2.38.1-ok5build1 libmpc-dev_1.1.0-ok1 libmpc3_1.1.0-ok1 libmpfr-dev_4.0.2-ok1 libmpfr6_4.0.2-ok1 libncursesw6_6.2-ok4 libnettle7_3.5.1+really3.5.1-ok3 libnpth0_1.6-ok1 libnsl-dev_2.0.0-ok1 libnsl2_2.0.0-ok1 libnspr4_2:4.25-ok1 libnss3_2:3.49.1-ok5 libobjc4_12.2.0-ok7 libp11-kit0_0.23.20-ok2 libpam-modules_1.3.1-ok3 libpam-modules-bin_1.3.1-ok3 libpam-runtime_1.3.1-ok3 libpam0g_1.3.1-ok3 libpcre2-8-0_10.34-ok2 libpcre3_2:8.39-ok5 libpcsclite1_1.8.26-ok2.1 libperl5.30_5.30.0-ok6 libpipeline1_1.5.3-ok1 libpng16-16_1.6.37-ok1 libpth20_2.0.7-ok1 libreadline8_8.0-ok2 libseccomp2_2.5.3-ok2 libselinux1_3.4-ok2 libsemanage-common_3.0-ok2 libsemanage1_3.0-ok2 libsepol1_3.0-ok1 libsepol2_3.4-ok2 libsigsegv2_2.12-ok1 libsmartcols1_2.38.1-ok5build1 libsqlite3-0_3.39.4-ok4 libss2_1.45.5-ok1 libssl1.1_1.1.1f-ok3 libssl3_3.0.8-ok4.1 libstdc++-9-dev_9.3.0-ok12 libstdc++6_12.2.0-ok7 libsub-override-perl_0.09-ok2 libsystemd-shared_251.4-ok1.7 libsystemd0_251.4-ok1.7 libtasn1-6_4.16.0-ok2 libtext-iconv-perl_1.7-ok1 libtiff5_4.1.0+git191117-ok3 libtinfo6_6.2-ok4 libtirpc-common_1.3.3+ds-1 libtirpc-dev_1.3.3-ok1 libtirpc3_1.3.3-ok1 libtool_2.4.7-ok3 libuchardet0_0.0.6-ok1 libudev1_251.4-ok1.7 libunistring2_1.0-2 libuuid1_2.38.1-ok5build1 libwebp7_1.2.2-ok4 libx11-6_2:1.8.4-ok2 libx11-data_2:1.8.4-ok2 libxau6_1:1.0.9-ok1 libxcb1_1.14-ok2 libxdmcp6_1:1.1.3-ok1 libxext6_2:1.3.4-ok2 libxi6_2:1.8-ok3 libxml2_2.9.14+dfsg-1.1build2 libxpm4_1:3.5.12-ok2 libxrender1_1:0.9.10-ok1 libxtst6_2:1.2.3-ok1 libxxhash0_0.8.1-ok1 libzstd-dev_1.5.2-ok2 libzstd1_1.5.2-ok2 linux-libc-dev_6.2.0-23.23 locales-all_2.36-ok6 lockfile-progs_0.1.19-ok1 login_1:4.8.1-ok3.1 logsave_1.45.5-ok1 lsb-base_11.1.0-ok2 lto-disabled-list_39 m4_1.4.18-ok3 make_4.2.1-ok1 man-db_2.9.1-ok3 mawk_1.3.4.20200120-ok1 mount_2.38.1-ok5build1 ncal_12.1.7-ok1 ncurses-base_6.2-ok4 ncurses-bin_6.2-ok4 nscd_2.36-ok6 openjdk-11-jre-headless_11.0.7+10-ok0 openkylin-keyring_2022.05.12-ok1 openssl_3.0.8-ok4.1 optipng_0.7.7-ok1 passwd_1:4.8.1-ok3.1 patch_2.7.6-ok1 perl_5.30.0-ok6 perl-base_5.30.0-ok6 perl-modules-5.30_5.30.0-ok6 pinentry-curses_1.1.0-ok1 pkgbinarymangler_150-ok1 po-debconf_1.0.21+nmu1-ok1 policyrcd-script-zg2_0.1-ok1 readline-common_8.0-ok2 rpcsvc-proto_1.4.3-ok1 sbuild-build-depends-core-dummy_0.invalid.0 sbuild-build-depends-libkylin-chkname-dummy_0.invalid.0 sed_4.7-ok1 sensible-utils_0.0.12+nmu1-ok2 systemd_251.4-ok1.7 systemd-sysv_251.4-ok1.7 systemd-timesyncd_251.4-ok1.7 sysvinit-utils_2.96-ok5 tar_1.30+dfsg-ok5 tzdata_2019c-ok1 ubuntu-keyring_2020.02.11.2-ok2 ucf_3.0043 update-motd_3.6-ok0 util-linux_2.38.1-ok5build1 util-linux-extra_2.38.1-ok5build1 x11-common_1:7.7+19ubuntu14-ok3 xz-utils_5.2.4-ok6 zlib1g_1:1.2.11.dfsg-ok3 zlib1g-dev_1:1.2.11.dfsg-ok3

+------------------------------------------------------------------------------+
| Build                                                                        |
+------------------------------------------------------------------------------+


Unpack source
-------------

gpgv: unknown type of key resource 'trustedkeys.kbx'
gpgv: keyblock resource '/tmp/dpkg-verify-sig.kvApFSbx/trustedkeys.kbx': General error
gpgv: Signature made Tue Mar 18 07:24:34 2025 UTC
gpgv:                using RSA key 64FBB79F5EAE64D792E94CFE0716F00F842CD274
gpgv: Can't check signature: No public key
dpkg-source: warning: cannot verify signature ./libkylin-chkname_1.0.10kylin3uk1-0k2.dsc
dpkg-source: info: extracting libkylin-chkname in libkylin-chkname-1.0.10kylin3uk1
dpkg-source: info: unpacking libkylin-chkname_1.0.10kylin3uk1.orig.tar.gz
dpkg-source: info: unpacking libkylin-chkname_1.0.10kylin3uk1-0k2.debian.tar.xz
dpkg-source: info: using patch list from debian/patches/series
dpkg-source: info: applying 0001-update-version-to-1.0.10kylin3uk1-0k2.patch

Check disc space
----------------

Sufficient free space for build

User Environment
----------------

APT_CONFIG=/var/lib/sbuild/apt.conf
DEB_BUILD_OPTIONS=noautodbgsym parallel=48
HOME=/sbuild-nonexistent
LANG=C.UTF-8
LC_ALL=C.UTF-8
LOGNAME=buildd
PATH=/usr/local/sbin:/usr/local/bin:/usr/sbin:/usr/bin:/sbin:/bin:/usr/games
SCHROOT_ALIAS_NAME=build-PACKAGEBUILD-288505
SCHROOT_CHROOT_NAME=build-PACKAGEBUILD-288505
SCHROOT_COMMAND=env
SCHROOT_GID=2501
SCHROOT_GROUP=buildd
SCHROOT_SESSION_ID=build-PACKAGEBUILD-288505
SCHROOT_UID=2001
SCHROOT_USER=buildd
SHELL=/bin/sh
TERM=unknown
USER=buildd
V=1

dpkg-buildpackage
-----------------

dpkg-buildpackage: info: source package libkylin-chkname
dpkg-buildpackage: info: source version 1.0.10kylin3uk1-0k2
dpkg-buildpackage: info: source distribution nile
 dpkg-source --before-build .
dpkg-buildpackage: info: host architecture rv64g
 fakeroot debian/rules clean
dh clean
   dh_clean
 debian/rules build-arch
dh build-arch
   dh_update_autotools_config -a
   dh_autoreconf -a
aclocal: warning: couldn't open directory 'm4': No such file or directory
libtoolize: putting auxiliary files in '.'.
libtoolize: copying file './ltmain.sh'
libtoolize: putting macros in 'm4'.
libtoolize: copying file 'm4/libtool.m4'
libtoolize: copying file 'm4/ltoptions.m4'
libtoolize: copying file 'm4/ltsugar.m4'
libtoolize: copying file 'm4/ltversion.m4'
libtoolize: copying file 'm4/lt~obsolete.m4'
libtoolize: Consider adding 'AC_CONFIG_MACRO_DIRS([m4])' to configure.ac,
libtoolize: and rerunning libtoolize and aclocal.
configure.ac:11: warning: The macro `AC_PROG_LIBTOOL' is obsolete.
configure.ac:11: You should run autoupdate.
m4/libtool.m4:100: AC_PROG_LIBTOOL is expanded from...
configure.ac:11: the top level
configure.ac:23: warning: AC_OUTPUT should be used without arguments.
configure.ac:23: You should run autoupdate.
configure.ac:10: installing './compile'
configure.ac:6: installing './missing'
Makefile.am: installing './depcomp'
   dh_auto_configure -a
	./configure --build=riscv64-linux-gnu --prefix=/usr --includedir=\${prefix}/include --mandir=\${prefix}/share/man --infodir=\${prefix}/share/info --sysconfdir=/etc --localstatedir=/var --disable-option-checking --disable-silent-rules --libdir=\${prefix}/lib/riscv64-linux-gnu --runstatedir=/run --disable-maintainer-mode --disable-dependency-tracking
checking for a BSD-compatible install... /usr/bin/install -c
checking whether build environment is sane... yes
checking for a race-free mkdir -p... /bin/mkdir -p
checking for gawk... no
checking for mawk... mawk
checking whether make sets $(MAKE)... yes
checking whether make supports nested variables... yes
checking for gcc... gcc
checking whether the C compiler works... yes
checking for C compiler default output file name... a.out
checking for suffix of executables... 
checking whether we are cross compiling... no
checking for suffix of object files... o
checking whether the compiler supports GNU C... yes
checking whether gcc accepts -g... yes
checking for gcc option to enable C11 features... none needed
checking whether gcc understands -c and -o together... yes
checking whether make supports the include directive... yes (GNU style)
checking dependency style of gcc... none
checking build system type... riscv64-unknown-linux-gnu
checking host system type... riscv64-unknown-linux-gnu
checking how to print strings... printf
checking for a sed that does not truncate output... /bin/sed
checking for grep that handles long lines and -e... /bin/grep
checking for egrep... /bin/grep -E
checking for fgrep... /bin/grep -F
checking for ld used by gcc... /usr/bin/ld
checking if the linker (/usr/bin/ld) is GNU ld... yes
checking for BSD- or MS-compatible name lister (nm)... /usr/bin/nm -B
checking the name lister (/usr/bin/nm -B) interface... BSD nm
checking whether ln -s works... yes
checking the maximum length of command line arguments... 1572864
checking how to convert riscv64-unknown-linux-gnu file names to riscv64-unknown-linux-gnu format... func_convert_file_noop
checking how to convert riscv64-unknown-linux-gnu file names to toolchain format... func_convert_file_noop
checking for /usr/bin/ld option to reload object files... -r
checking for file... file
checking for objdump... objdump
checking how to recognize dependent libraries... pass_all
checking for dlltool... no
checking how to associate runtime and link libraries... printf %s\n
checking for ar... ar
checking for archiver @FILE support... @
checking for strip... strip
checking for ranlib... ranlib
checking command to parse /usr/bin/nm -B output from gcc object... ok
checking for sysroot... no
checking for a working dd... /bin/dd
checking how to truncate binary pipes... /bin/dd bs=4096 count=1
checking for mt... no
checking if : is a manifest tool... no
checking for stdio.h... yes
checking for stdlib.h... yes
checking for string.h... yes
checking for inttypes.h... yes
checking for stdint.h... yes
checking for strings.h... yes
checking for sys/stat.h... yes
checking for sys/types.h... yes
checking for unistd.h... yes
checking for dlfcn.h... yes
checking for objdir... .libs
checking if gcc supports -fno-rtti -fno-exceptions... no
checking for gcc option to produce PIC... -fPIC -DPIC
checking if gcc PIC flag -fPIC -DPIC works... yes
checking if gcc static flag -static works... yes
checking if gcc supports -c -o file.o... yes
checking if gcc supports -c -o file.o... (cached) yes
checking whether the gcc linker (/usr/bin/ld) supports shared libraries... yes
checking whether -lc should be explicitly linked in... no
checking dynamic linker characteristics... GNU/Linux ld.so
checking how to hardcode library paths into programs... immediate
checking whether stripping libraries is possible... yes
checking if libtool supports shared libraries... yes
checking whether to build shared libraries... yes
checking whether to build static libraries... yes
checking for libintl.h... yes
checking for string.h... (cached) yes
checking for syslog.h... yes
checking for strerror... yes
checking that generated files are newer than configure... done
configure: creating ./config.status
config.status: creating Makefile
config.status: creating po/Makefile.in
config.status: creating config.h
config.status: executing depfiles commands
config.status: executing libtool commands
   dh_auto_build -a
	make -j48
make[1]: Entering directory '/<<PKGBUILDDIR>>'
make  all-recursive
make[2]: Entering directory '/<<PKGBUILDDIR>>'
Making all in po
make[3]: Entering directory '/<<PKGBUILDDIR>>/po'
make[3]: *** No rule to make target 'all'.  Stop.
make[3]: Leaving directory '/<<PKGBUILDDIR>>/po'
make[2]: *** [Makefile:558: all-recursive] Error 1
make[2]: Leaving directory '/<<PKGBUILDDIR>>'
make[1]: *** [Makefile:395: all] Error 2
make[1]: Leaving directory '/<<PKGBUILDDIR>>'
dh_auto_build: error: make -j48 returned exit code 2
make: *** [debian/rules:18: build-arch] Error 25
dpkg-buildpackage: error: debian/rules build-arch subprocess returned exit status 2
--------------------------------------------------------------------------------
Build finished at 20250318-1544

Finished
--------

E: Build failure (dpkg-buildpackage died)

+------------------------------------------------------------------------------+
| Cleanup                                                                      |
+------------------------------------------------------------------------------+

Purging /<<BUILDDIR>>
Not removing build depends: as requested

+------------------------------------------------------------------------------+
| Summary                                                                      |
+------------------------------------------------------------------------------+

Build Architecture: rv64g
Build-Space: 4932
Build-Time: 84
Distribution: yangtze
Fail-Stage: build
Foreign Architectures: riscv64
Host Architecture: rv64g
Install-Time: 210
Job: libkylin-chkname_1.0.10kylin3uk1-0k2.dsc
Machine Architecture: riscv64
Package: libkylin-chkname
Package-Time: 304
Source-Version: 1.0.10kylin3uk1-0k2
Space: 4932
Status: attempted
Version: 1.0.10kylin3uk1-0k2
--------------------------------------------------------------------------------
Finished at 20250318-1544
Build needed 00:05:04, 4932k disc space
Adding user buildd to group lxd
RUN: /usr/share/launchpad-buildd/bin/in-target scan-for-processes --backend=chroot --series=yangtze --arch=rv64g PACKAGEBUILD-288505
Scanning for processes to kill in build PACKAGEBUILD-288505
RUN: /usr/share/launchpad-buildd/bin/in-target umount-chroot --backend=chroot --series=yangtze --arch=rv64g PACKAGEBUILD-288505
Stopping target for build PACKAGEBUILD-288505
RUN: /usr/share/launchpad-buildd/bin/in-target remove-build --backend=chroot --series=yangtze --arch=rv64g PACKAGEBUILD-288505
Removing build PACKAGEBUILD-288505