https://build.openkylin.top/~cibot/+archive/openkylin/jenkins-ci-open-mr-8675/+build/288571
RUN: /usr/share/launchpad-buildd/bin/builder-prep 
Kernel version: Linux 2f6cb779b462 5.4.0-126-generic #142-Ubuntu SMP Fri Aug 26 12:12:57 UTC 2022 x86_64
Buildd toolchain package versions: launchpad-buildd_203~505~kylin18.04.1k3 python-lpbuildd_203~505~kylin18.04.1k3 python3-lpbuildd_203~505~kylin18.04.1k3 sbuild_0.79.0-1ubuntu1 dpkg-dev_1.19.7ubuntu3 python-debian_0.1.36ubuntu1 python3-debian_0.1.36ubuntu1.
RUN: /usr/share/launchpad-buildd/bin/in-target unpack-chroot --backend=chroot --series=nile --arch=amd64 PACKAGEBUILD-288571 --image-type chroot /home/buildd/filecache-default/9f6cb802391e7e2d31468777a36c77616c6886b4
Creating target for build PACKAGEBUILD-288571
RUN: /usr/share/launchpad-buildd/bin/in-target mount-chroot --backend=chroot --series=nile --arch=amd64 PACKAGEBUILD-288571
Starting target for build PACKAGEBUILD-288571
RUN: /usr/share/launchpad-buildd/bin/in-target override-sources-list --backend=chroot --series=nile --arch=amd64 PACKAGEBUILD-288571 'deb http://archive.build.openkylin.top/openkylin nile main' 'deb http://archive.build.openkylin.top/openkylin nile-security main' 'deb http://archive.build.openkylin.top/openkylin nile-updates main' 'deb http://archive.build.openkylin.top/openkylin nile-proposed main'
Can't find dpkg-alter package
Overriding sources.list in build-PACKAGEBUILD-288571
RUN: /usr/share/launchpad-buildd/bin/in-target add-trusted-keys --backend=chroot --series=nile --arch=amd64 PACKAGEBUILD-288571
Adding trusted keys to build-PACKAGEBUILD-288571
Warning: apt-key is deprecated. Manage keyring files in trusted.gpg.d instead (see apt-key(8)).
OK
Warning: apt-key is deprecated. Manage keyring files in trusted.gpg.d instead (see apt-key(8)).
/etc/apt/trusted.gpg.d/openkylin-archive-keyring.gpg
----------------------------------------------------
pub   rsa4096 2022-05-12 [SC] [expires: 2032-05-09]
      09FF C10E A273 DD29 A986  B110 8B31 3CEA FF59 2D96
uid           [ unknown] openKylin Archive Signing Key <release-team@openkylin.top>
sub   rsa4096 2022-05-12 [E] [expires: 2032-05-09]

/etc/apt/trusted.gpg.d/ubuntu-keyring-2012-archive.gpg
------------------------------------------------------
pub   rsa4096 2012-05-11 [SC]
      790B C727 7767 219C 42C8  6F93 3B4F E6AC C0B2 1F32
uid           [ unknown] Ubuntu Archive Automatic Signing Key (2012) <ftpmaster@ubuntu.com>

/etc/apt/trusted.gpg.d/ubuntu-keyring-2012-cdimage.gpg
------------------------------------------------------
pub   rsa4096 2012-05-11 [SC]
      8439 38DF 228D 22F7 B374  2BC0 D94A A3F0 EFE2 1092
uid           [ unknown] Ubuntu CD Image Automatic Signing Key (2012) <cdimage@ubuntu.com>

/etc/apt/trusted.gpg.d/ubuntu-keyring-2018-archive.gpg
------------------------------------------------------
pub   rsa4096 2018-09-17 [SC]
      F6EC B376 2474 EDA9 D21B  7022 8719 20D1 991B C93C
uid           [ unknown] Ubuntu Archive Automatic Signing Key (2018) <ftpmaster@ubuntu.com>

RUN: /usr/share/launchpad-buildd/bin/in-target update-debian-chroot --backend=chroot --series=nile --arch=amd64 PACKAGEBUILD-288571
Updating target for build PACKAGEBUILD-288571
Get:1 http://archive.build.openkylin.top/openkylin nile InRelease [43.5 kB]
Get:2 http://archive.build.openkylin.top/openkylin nile-security InRelease [43.5 kB]
Get:3 http://archive.build.openkylin.top/openkylin nile-updates InRelease [43.5 kB]
Get:4 http://archive.build.openkylin.top/openkylin nile-proposed InRelease [43.5 kB]
Get:5 http://archive.build.openkylin.top/OTHER/Internal-mirror/repack6/baseok0 nile InRelease [5617 B]
Get:6 http://archive.build.openkylin.top/OTHER/Internal-mirror/amd64-stage0 nile InRelease [3758 B]
Get:7 http://archive.build.openkylin.top/openkylin nile/main amd64 Packages [3255 kB]
Get:8 http://archive.build.openkylin.top/openkylin nile-proposed/main amd64 Packages [2890 kB]
Get:9 http://archive.build.openkylin.top/OTHER/Internal-mirror/repack6/baseok0 nile/main amd64 Packages [26.9 MB]
Get:10 http://archive.build.openkylin.top/OTHER/Internal-mirror/amd64-stage0 nile/main amd64 Packages [19.9 kB]
Fetched 33.3 MB in 19s (1758 kB/s)
Reading package lists...
Reading package lists...
Building dependency tree...
Reading state information...
Calculating upgrade...
The following packages were automatically installed and are no longer required:
  libffi7 libhogweed5 libnettle7 lto-disabled-list
Use 'sudo apt autoremove' to remove them.
The following packages will be REMOVED:
  libapt-pkg6.0* libgnutls30* libnpth0* libpng16-16* libssl3*
The following NEW packages will be installed:
  libapt-pkg6.0t64 libgnutls30t64 libhogweed6t64 libnettle8t64 libnpth0t64
  libpng16-16t64 libssl3t64 libunistring5
The following packages will be upgraded:
  apt base-files base-passwd binutils binutils-common
  binutils-x86-64-linux-gnu bsdutils coreutils debconf dpkg dpkg-dev fdisk gpg
  gpg-agent gpgconf gpgv libapparmor1 libbinutils libblkid1 libc-bin
  libc-dev-bin libc6 libc6-dev libcryptsetup12 libctf-nobfd0 libctf0
  libdpkg-perl libfdisk1 libffi8 libgprofng0 libmount1 libnsl-dev libnsl2
  libpam-modules libpam-modules-bin libpam-runtime libpam0g libseccomp2
  libselinux1 libsframe1 libsmartcols1 libsqlite3-0 libsystemd-shared
  libsystemd0 libudev1 libuuid1 libxxhash0 linux-libc-dev login
  lto-disabled-list make mawk mount openssl optipng passwd pkgbinarymangler
  sensible-utils systemd systemd-dev systemd-sysv systemd-timesyncd
  ubuntu-keyring util-linux util-linux-extra zlib1g
66 upgraded, 8 newly installed, 5 to remove and 0 not upgraded.
Need to get 38.5 MB of archives.
After this operation, 6856 kB of additional disk space will be used.
Get:1 http://archive.build.openkylin.top/openkylin nile/main amd64 libnsl-dev amd64 2.0.0-ok2 [28.3 kB]
Get:2 http://archive.build.openkylin.top/openkylin nile/main amd64 libc6-dev amd64 2.38-1ok6.9 [1956 kB]
Get:3 http://archive.build.openkylin.top/openkylin nile/main amd64 libc-dev-bin amd64 2.38-1ok6.9 [19.2 kB]
Get:4 http://archive.build.openkylin.top/openkylin nile/main amd64 libnsl2 amd64 2.0.0-ok2 [21.6 kB]
Get:5 http://archive.build.openkylin.top/openkylin nile/main amd64 linux-libc-dev amd64 6.6.0-15.0ok13 [1326 kB]
Get:6 http://archive.build.openkylin.top/openkylin nile/main amd64 libc6 amd64 2.38-1ok6.9 [2815 kB]
Get:7 http://archive.build.openkylin.top/openkylin nile/main amd64 base-files amd64 13-ok2.2 [57.8 kB]
Get:8 http://archive.build.openkylin.top/openkylin nile/main amd64 bsdutils amd64 1:2.39.3-ok2build5 [87.6 kB]
Get:9 http://archive.build.openkylin.top/openkylin nile-proposed/main amd64 systemd-timesyncd amd64 255.2-ok1.12 [34.2 kB]
Get:10 http://archive.build.openkylin.top/openkylin nile/main amd64 libapparmor1 amd64 4.0.0-beta3-ok1 [32.3 kB]
Get:11 http://archive.build.openkylin.top/openkylin nile/main amd64 libblkid1 amd64 2.39.3-ok2build5 [116 kB]
Get:12 http://archive.build.openkylin.top/openkylin nile/main amd64 libselinux1 amd64 3.5-ok2 [73.5 kB]
Get:13 http://archive.build.openkylin.top/openkylin nile/main amd64 libmount1 amd64 2.39.3-ok2build5 [122 kB]
Get:14 http://archive.build.openkylin.top/openkylin nile/main amd64 debconf all 1.5.86-ok1 [119 kB]
Get:15 http://archive.build.openkylin.top/openkylin nile/main amd64 libpam0g amd64 1.5.3-ok7 [54.4 kB]
Get:16 http://archive.build.openkylin.top/openkylin nile/main amd64 libseccomp2 amd64 2.5.5-1ok1.3 [45.2 kB]
Get:17 http://archive.build.openkylin.top/openkylin nile/main amd64 openssl amd64 3.2.1-ok7 [1278 kB]
Get:18 http://archive.build.openkylin.top/openkylin nile/main amd64 libcryptsetup12 amd64 2:2.6.1-ok7 [212 kB]
Get:19 http://archive.build.openkylin.top/openkylin nile/main amd64 libssl3t64 amd64 3.2.1-ok7 [1986 kB]
Get:20 http://archive.build.openkylin.top/openkylin nile/main amd64 coreutils amd64 9.4-ok4 [2817 kB]
Get:21 http://archive.build.openkylin.top/openkylin nile-proposed/main amd64 systemd-sysv amd64 255.2-ok1.12 [11.5 kB]
Get:22 http://archive.build.openkylin.top/openkylin nile-proposed/main amd64 systemd-dev all 255.2-ok1.12 [21.3 kB]
Get:23 http://archive.build.openkylin.top/openkylin nile-proposed/main amd64 systemd amd64 255.2-ok1.12 [3506 kB]
Get:24 http://archive.build.openkylin.top/openkylin nile-proposed/main amd64 libsystemd-shared amd64 255.2-ok1.12 [1888 kB]
Get:25 http://archive.build.openkylin.top/openkylin nile-proposed/main amd64 libsystemd0 amd64 255.2-ok1.12 [323 kB]
Get:26 http://archive.build.openkylin.top/openkylin nile/main amd64 libuuid1 amd64 2.39.3-ok2build5 [33.7 kB]
Get:27 http://archive.build.openkylin.top/openkylin nile/main amd64 libfdisk1 amd64 2.39.3-ok2build5 [136 kB]
Get:28 http://archive.build.openkylin.top/openkylin nile/main amd64 mount amd64 2.39.3-ok2build5 [110 kB]
Get:29 http://archive.build.openkylin.top/openkylin nile-proposed/main amd64 libudev1 amd64 255.2-ok1.12 [85.8 kB]
Get:30 http://archive.build.openkylin.top/openkylin nile/main amd64 libxxhash0 amd64 0.8.2-ok1 [22.4 kB]
Get:31 http://archive.build.openkylin.top/openkylin nile/main amd64 zlib1g amd64 1:1.3.dfsg-ok3 [56.1 kB]
Get:32 http://archive.build.openkylin.top/openkylin nile/main amd64 libnettle8t64 amd64 3.9.1-ok2 [171 kB]
Get:33 http://archive.build.openkylin.top/openkylin nile/main amd64 libhogweed6t64 amd64 3.9.1-ok2 [197 kB]
Get:34 http://archive.build.openkylin.top/openkylin nile/main amd64 libunistring5 amd64 1.1-ok1 [539 kB]
Get:35 http://archive.build.openkylin.top/openkylin nile/main amd64 libgnutls30t64 amd64 3.8.3-ok3 [1023 kB]
Get:36 http://archive.build.openkylin.top/openkylin nile/main amd64 libapt-pkg6.0t64 amd64 2.8.0-ok2 [874 kB]
Get:37 http://archive.build.openkylin.top/openkylin nile/main amd64 apt amd64 2.8.0-ok2 [1289 kB]
Get:38 http://archive.build.openkylin.top/openkylin nile/main amd64 dpkg amd64 1.22.6-ok3 [1284 kB]
Get:39 http://archive.build.openkylin.top/openkylin nile/main amd64 login amd64 1:4.14.3-ok3.5 [455 kB]
Get:40 http://archive.build.openkylin.top/openkylin nile/main amd64 libsmartcols1 amd64 2.39.3-ok2build5 [61.5 kB]
Get:41 http://archive.build.openkylin.top/openkylin nile/main amd64 util-linux-extra amd64 2.39.3-ok2build5 [109 kB]
Get:42 http://archive.build.openkylin.top/openkylin nile/main amd64 util-linux amd64 2.39.3-ok2build5 [1060 kB]
Get:43 http://archive.build.openkylin.top/openkylin nile/main amd64 base-passwd amd64 3.6.3-ok2 [49.1 kB]
Get:44 http://archive.build.openkylin.top/openkylin nile/main amd64 libc-bin amd64 2.38-1ok6.9 [615 kB]
Get:45 http://archive.build.openkylin.top/openkylin nile/main amd64 libsqlite3-0 amd64 3.42.0-ok1 [632 kB]
Get:46 http://archive.build.openkylin.top/openkylin nile/main amd64 gpg amd64 2.4.3-ok11 [514 kB]
Get:47 http://archive.build.openkylin.top/openkylin nile/main amd64 gpg-agent amd64 2.4.3-ok11 [205 kB]
Get:48 http://archive.build.openkylin.top/openkylin nile/main amd64 gpgconf amd64 2.4.3-ok11 [88.5 kB]
Get:49 http://archive.build.openkylin.top/openkylin nile/main amd64 libnpth0t64 amd64 1.6-ok2 [7360 B]
Get:50 http://archive.build.openkylin.top/openkylin nile/main amd64 gpgv amd64 2.4.3-ok11 [141 kB]
Get:51 http://archive.build.openkylin.top/openkylin nile/main amd64 optipng amd64 0.7.8+ds-ok1 [99.5 kB]
Get:52 http://archive.build.openkylin.top/openkylin nile/main amd64 libpng16-16t64 amd64 1.6.43-ok1 [180 kB]
Get:53 http://archive.build.openkylin.top/openkylin nile/main amd64 libpam-modules-bin amd64 1.5.3-ok7 [48.0 kB]
Get:54 http://archive.build.openkylin.top/openkylin nile/main amd64 libpam-modules amd64 1.5.3-ok7 [266 kB]
Get:55 http://archive.build.openkylin.top/openkylin nile/main amd64 libpam-runtime all 1.5.3-ok7 [126 kB]
Get:56 http://archive.build.openkylin.top/openkylin nile/main amd64 passwd amd64 1:4.14.3-ok3.5 [789 kB]
Get:57 http://archive.build.openkylin.top/openkylin nile/main amd64 libffi8 amd64 3.4.6-ok2 [21.5 kB]
Get:58 http://archive.build.openkylin.top/openkylin nile/main amd64 mawk amd64 1.3.4.20240123-ok1 [117 kB]
Get:59 http://archive.build.openkylin.top/openkylin nile/main amd64 sensible-utils all 0.0.22-ok1 [20.1 kB]
Get:60 http://archive.build.openkylin.top/openkylin nile/main amd64 fdisk amd64 2.39.3-ok2build5 [111 kB]
Get:61 http://archive.build.openkylin.top/openkylin nile/main amd64 ubuntu-keyring all 2023.11.28.1-ok1 [10.6 kB]
Get:62 http://archive.build.openkylin.top/openkylin nile/main amd64 libgprofng0 amd64 2.41-ok13 [819 kB]
Get:63 http://archive.build.openkylin.top/openkylin nile/main amd64 libctf0 amd64 2.41-ok13 [89.8 kB]
Get:64 http://archive.build.openkylin.top/openkylin nile/main amd64 libctf-nobfd0 amd64 2.41-ok13 [92.0 kB]
Get:65 http://archive.build.openkylin.top/openkylin nile/main amd64 binutils amd64 2.41-ok13 [17.1 kB]
Get:66 http://archive.build.openkylin.top/openkylin nile/main amd64 binutils-x86-64-linux-gnu amd64 2.41-ok13 [2121 kB]
Get:67 http://archive.build.openkylin.top/openkylin nile/main amd64 libbinutils amd64 2.41-ok13 [540 kB]
Get:68 http://archive.build.openkylin.top/openkylin nile/main amd64 binutils-common amd64 2.41-ok13 [2389 kB]
Get:69 http://archive.build.openkylin.top/openkylin nile/main amd64 libsframe1 amd64 2.41-ok13 [13.7 kB]
Get:70 http://archive.build.openkylin.top/openkylin nile/main amd64 dpkg-dev all 1.22.6-ok3 [1150 kB]
Get:71 http://archive.build.openkylin.top/openkylin nile/main amd64 libdpkg-perl all 1.22.6-ok3 [415 kB]
Get:72 http://archive.build.openkylin.top/openkylin nile/main amd64 make amd64 4.3-ok1 [341 kB]
Get:73 http://archive.build.openkylin.top/openkylin nile/main amd64 lto-disabled-list all 24-ok21 [11.9 kB]
Get:74 http://archive.build.openkylin.top/openkylin nile/main amd64 pkgbinarymangler all 154-ok3 [14.9 kB]
debconf: delaying package configuration, since apt-utils is not installed
Fetched 38.5 MB in 7s (5762 kB/s)
(Reading database ... 13619 files and directories currently installed.)
Preparing to unpack .../0-libnsl-dev_2.0.0-ok2_amd64.deb ...
Unpacking libnsl-dev:amd64 (2.0.0-ok2) over (2.0.0-ok1) ...
Preparing to unpack .../1-libc6-dev_2.38-1ok6.9_amd64.deb ...
Unpacking libc6-dev:amd64 (2.38-1ok6.9) over (2.38-1ok6.8) ...
Preparing to unpack .../2-libc-dev-bin_2.38-1ok6.9_amd64.deb ...
Unpacking libc-dev-bin (2.38-1ok6.9) over (2.38-1ok6.8) ...
Preparing to unpack .../3-libnsl2_2.0.0-ok2_amd64.deb ...
Unpacking libnsl2:amd64 (2.0.0-ok2) over (2.0.0-ok1) ...
Preparing to unpack .../4-linux-libc-dev_6.6.0-15.0ok13_amd64.deb ...
Unpacking linux-libc-dev:amd64 (6.6.0-15.0ok13) over (6.6.0-1.0ok5) ...
Preparing to unpack .../5-libc6_2.38-1ok6.9_amd64.deb ...
Unpacking libc6:amd64 (2.38-1ok6.9) over (2.38-1ok6.8) ...
Setting up libc6:amd64 (2.38-1ok6.9) ...
(Reading database ... 13620 files and directories currently installed.)
Preparing to unpack .../base-files_13-ok2.2_amd64.deb ...
Unpacking base-files (13-ok2.2) over (11-ok14) ...
Setting up base-files (13-ok2.2) ...
Installing new version of config file /etc/issue ...
Installing new version of config file /etc/issue.net ...
Installing new version of config file /etc/lsb-release ...
(Reading database ... 13620 files and directories currently installed.)
Preparing to unpack .../bsdutils_1%3a2.39.3-ok2build5_amd64.deb ...
Unpacking bsdutils (1:2.39.3-ok2build5) over (1:2.39.3-ok2build4) ...
Setting up bsdutils (1:2.39.3-ok2build5) ...
(Reading database ... 13620 files and directories currently installed.)
Preparing to unpack .../systemd-timesyncd_255.2-ok1.12_amd64.deb ...
Unpacking systemd-timesyncd (255.2-ok1.12) over (255.2-ok1.1) ...
Preparing to unpack .../libapparmor1_4.0.0-beta3-ok1_amd64.deb ...
Unpacking libapparmor1:amd64 (4.0.0-beta3-ok1) over (2.13.3-ok1) ...
Preparing to unpack .../libblkid1_2.39.3-ok2build5_amd64.deb ...
Unpacking libblkid1:amd64 (2.39.3-ok2build5) over (2.39.3-ok2build4) ...
Setting up libblkid1:amd64 (2.39.3-ok2build5) ...
(Reading database ... 13619 files and directories currently installed.)
Preparing to unpack .../libselinux1_3.5-ok2_amd64.deb ...
Unpacking libselinux1:amd64 (3.5-ok2) over (3.5-ok1) ...
Setting up libselinux1:amd64 (3.5-ok2) ...
(Reading database ... 13619 files and directories currently installed.)
Preparing to unpack .../libmount1_2.39.3-ok2build5_amd64.deb ...
Unpacking libmount1:amd64 (2.39.3-ok2build5) over (2.39.3-ok2build4) ...
Setting up libmount1:amd64 (2.39.3-ok2build5) ...
(Reading database ... 13619 files and directories currently installed.)
Preparing to unpack .../debconf_1.5.86-ok1_all.deb ...
Unpacking debconf (1.5.86-ok1) over (1.5.73-ok1) ...
Setting up debconf (1.5.86-ok1) ...
Installing new version of config file /etc/debconf.conf ...
(Reading database ... 13617 files and directories currently installed.)
Preparing to unpack .../libpam0g_1.5.3-ok7_amd64.deb ...
Unpacking libpam0g:amd64 (1.5.3-ok7) over (1.5.3-ok4) ...
Setting up libpam0g:amd64 (1.5.3-ok7) ...
(Reading database ... 13616 files and directories currently installed.)
Preparing to unpack .../libseccomp2_2.5.5-1ok1.3_amd64.deb ...
Unpacking libseccomp2:amd64 (2.5.5-1ok1.3) over (2.5.5-1ok1.1) ...
Setting up libseccomp2:amd64 (2.5.5-1ok1.3) ...
(Reading database ... 13616 files and directories currently installed.)
Preparing to unpack .../openssl_3.2.1-ok7_amd64.deb ...
Unpacking openssl (3.2.1-ok7) over (3.2.1-ok1) ...
Preparing to unpack .../libcryptsetup12_2%3a2.6.1-ok7_amd64.deb ...
Unpacking libcryptsetup12:amd64 (2:2.6.1-ok7) over (2:2.6.1-ok4) ...
dpkg: libssl3:amd64: dependency problems, but removing anyway as you requested:
 systemd depends on libssl3 (>= 3.0.0).
 libsystemd-shared:amd64 depends on libssl3 (>= 3.0.0).
 libkrb5-3:amd64 depends on libssl3 (>= 3.0.0).
 libkmod2:amd64 depends on libssl3 (>= 3.0.0).
 coreutils depends on libssl3 (>= 3.0.0).

(Reading database ... 13615 files and directories currently installed.)
Removing libssl3:amd64 (3.2.1-ok1) ...
Selecting previously unselected package libssl3t64:amd64.
(Reading database ... 13604 files and directories currently installed.)
Preparing to unpack .../libssl3t64_3.2.1-ok7_amd64.deb ...
Unpacking libssl3t64:amd64 (3.2.1-ok7) ...
Setting up libssl3t64:amd64 (3.2.1-ok7) ...
(Reading database ... 13618 files and directories currently installed.)
Preparing to unpack .../coreutils_9.4-ok4_amd64.deb ...
Unpacking coreutils (9.4-ok4) over (9.4-ok2) ...
Setting up coreutils (9.4-ok4) ...
(Reading database ... 13617 files and directories currently installed.)
Preparing to unpack .../systemd-sysv_255.2-ok1.12_amd64.deb ...
Unpacking systemd-sysv (255.2-ok1.12) over (255.2-ok1.1) ...
Preparing to unpack .../systemd-dev_255.2-ok1.12_all.deb ...
Unpacking systemd-dev (255.2-ok1.12) over (255.2-ok1.1) ...
Preparing to unpack .../systemd_255.2-ok1.12_amd64.deb ...
Unpacking systemd (255.2-ok1.12) over (255.2-ok1.1) ...
Preparing to unpack .../libsystemd-shared_255.2-ok1.12_amd64.deb ...
Unpacking libsystemd-shared:amd64 (255.2-ok1.12) over (255.2-ok1.1) ...
Preparing to unpack .../libsystemd0_255.2-ok1.12_amd64.deb ...
Unpacking libsystemd0:amd64 (255.2-ok1.12) over (255.2-ok1.1) ...
Setting up libsystemd0:amd64 (255.2-ok1.12) ...
(Reading database ... 13631 files and directories currently installed.)
Preparing to unpack .../libuuid1_2.39.3-ok2build5_amd64.deb ...
Unpacking libuuid1:amd64 (2.39.3-ok2build5) over (2.39.3-ok2build4) ...
Setting up libuuid1:amd64 (2.39.3-ok2build5) ...
(Reading database ... 13631 files and directories currently installed.)
Preparing to unpack .../libfdisk1_2.39.3-ok2build5_amd64.deb ...
Unpacking libfdisk1:amd64 (2.39.3-ok2build5) over (2.39.3-ok2build4) ...
Preparing to unpack .../mount_2.39.3-ok2build5_amd64.deb ...
Unpacking mount (2.39.3-ok2build5) over (2.39.3-ok2build4) ...
Preparing to unpack .../libudev1_255.2-ok1.12_amd64.deb ...
Unpacking libudev1:amd64 (255.2-ok1.12) over (255.2-ok1.1) ...
Setting up libudev1:amd64 (255.2-ok1.12) ...
(Reading database ... 13631 files and directories currently installed.)
Preparing to unpack .../libxxhash0_0.8.2-ok1_amd64.deb ...
Unpacking libxxhash0:amd64 (0.8.2-ok1) over (0.8.1-ok1) ...
Setting up libxxhash0:amd64 (0.8.2-ok1) ...
(Reading database ... 13631 files and directories currently installed.)
Preparing to unpack .../zlib1g_1%3a1.3.dfsg-ok3_amd64.deb ...
Unpacking zlib1g:amd64 (1:1.3.dfsg-ok3) over (1:1.3.dfsg-ok2) ...
Setting up zlib1g:amd64 (1:1.3.dfsg-ok3) ...
Selecting previously unselected package libnettle8t64:amd64.
(Reading database ... 13631 files and directories currently installed.)
Preparing to unpack .../libnettle8t64_3.9.1-ok2_amd64.deb ...
Unpacking libnettle8t64:amd64 (3.9.1-ok2) ...
Setting up libnettle8t64:amd64 (3.9.1-ok2) ...
Selecting previously unselected package libhogweed6t64:amd64.
(Reading database ... 13639 files and directories currently installed.)
Preparing to unpack .../libhogweed6t64_3.9.1-ok2_amd64.deb ...
Unpacking libhogweed6t64:amd64 (3.9.1-ok2) ...
Setting up libhogweed6t64:amd64 (3.9.1-ok2) ...
Selecting previously unselected package libunistring5:amd64.
(Reading database ... 13645 files and directories currently installed.)
Preparing to unpack .../libunistring5_1.1-ok1_amd64.deb ...
Unpacking libunistring5:amd64 (1.1-ok1) ...
Setting up libunistring5:amd64 (1.1-ok1) ...
dpkg: libgnutls30:amd64: dependency problems, but removing anyway as you requested:
 apt depends on libgnutls30 (>= 3.6.12).

(Reading database ... 13650 files and directories currently installed.)
Removing libgnutls30:amd64 (3.6.13-ok10) ...
Selecting previously unselected package libgnutls30t64:amd64.
(Reading database ... 13624 files and directories currently installed.)
Preparing to unpack .../libgnutls30t64_3.8.3-ok3_amd64.deb ...
Unpacking libgnutls30t64:amd64 (3.8.3-ok3) ...
Setting up libgnutls30t64:amd64 (3.8.3-ok3) ...
dpkg: libapt-pkg6.0:amd64: dependency problems, but removing anyway as you requested:
 apt depends on libapt-pkg6.0 (>= 2.7.3-ok3).

(Reading database ... 13652 files and directories currently installed.)
Removing libapt-pkg6.0:amd64 (2.7.3-ok3) ...
Selecting previously unselected package libapt-pkg6.0t64:amd64.
(Reading database ... 13603 files and directories currently installed.)
Preparing to unpack .../libapt-pkg6.0t64_2.8.0-ok2_amd64.deb ...
Unpacking libapt-pkg6.0t64:amd64 (2.8.0-ok2) ...
Setting up libapt-pkg6.0t64:amd64 (2.8.0-ok2) ...
(Reading database ... 13653 files and directories currently installed.)
Preparing to unpack .../apt_2.8.0-ok2_amd64.deb ...
Unpacking apt (2.8.0-ok2) over (2.7.3-ok3) ...
Setting up apt (2.8.0-ok2) ...
(Reading database ... 13653 files and directories currently installed.)
Preparing to unpack .../dpkg_1.22.6-ok3_amd64.deb ...
Unpacking dpkg (1.22.6-ok3) over (1.22.6-ok2) ...
Setting up dpkg (1.22.6-ok3) ...
dpkg: warning: This system uses merged-usr-via-aliased-dirs, going behind dpkg's
dpkg: warning: back, breaking its core assumptions. This can cause silent file
dpkg: warning: overwrites and disappearances, and its general tools misbehavior.
dpkg: warning: See <https://wiki.debian.org/Teams/Dpkg/FAQ#broken-usrmerge>.
(Reading database ... 13653 files and directories currently installed.)
Preparing to unpack .../login_1%3a4.14.3-ok3.5_amd64.deb ...
Unpacking login (1:4.14.3-ok3.5) over (1:4.14.3-ok3) ...
Setting up login (1:4.14.3-ok3.5) ...
(Reading database ... 13652 files and directories currently installed.)
Preparing to unpack .../libsmartcols1_2.39.3-ok2build5_amd64.deb ...
Unpacking libsmartcols1:amd64 (2.39.3-ok2build5) over (2.39.3-ok2build4) ...
Setting up libsmartcols1:amd64 (2.39.3-ok2build5) ...
(Reading database ... 13652 files and directories currently installed.)
Preparing to unpack .../util-linux-extra_2.39.3-ok2build5_amd64.deb ...
Unpacking util-linux-extra (2.39.3-ok2build5) over (2.39.3-ok2build4) ...
Preparing to unpack .../util-linux_2.39.3-ok2build5_amd64.deb ...
Unpacking util-linux (2.39.3-ok2build5) over (2.39.3-ok2build4) ...
Setting up util-linux (2.39.3-ok2build5) ...
(Reading database ... 13652 files and directories currently installed.)
Preparing to unpack .../base-passwd_3.6.3-ok2_amd64.deb ...
Unpacking base-passwd (3.6.3-ok2) over (3.6.1-ok1) ...
Setting up base-passwd (3.6.3-ok2) ...
(Reading database ... 13652 files and directories currently installed.)
Preparing to unpack .../libc-bin_2.38-1ok6.9_amd64.deb ...
Unpacking libc-bin (2.38-1ok6.9) over (2.38-1ok6.8) ...
Setting up libc-bin (2.38-1ok6.9) ...
(Reading database ... 13652 files and directories currently installed.)
Preparing to unpack .../libsqlite3-0_3.42.0-ok1_amd64.deb ...
Unpacking libsqlite3-0:amd64 (3.42.0-ok1) over (3.39.4-ok3) ...
Preparing to unpack .../gpg_2.4.3-ok11_amd64.deb ...
Unpacking gpg (2.4.3-ok11) over (2.4.3-ok10) ...
Preparing to unpack .../gpg-agent_2.4.3-ok11_amd64.deb ...
Unpacking gpg-agent (2.4.3-ok11) over (2.4.3-ok10) ...
Preparing to unpack .../gpgconf_2.4.3-ok11_amd64.deb ...
Unpacking gpgconf (2.4.3-ok11) over (2.4.3-ok10) ...
dpkg: libnpth0:amd64: dependency problems, but removing anyway as you requested:
 gpgv depends on libnpth0 (>= 0.90).

(Reading database ... 13652 files and directories currently installed.)
Removing libnpth0:amd64 (1.6-ok1) ...
Selecting previously unselected package libnpth0t64:amd64.
(Reading database ... 13647 files and directories currently installed.)
Preparing to unpack .../libnpth0t64_1.6-ok2_amd64.deb ...
Unpacking libnpth0t64:amd64 (1.6-ok2) ...
Setting up libnpth0t64:amd64 (1.6-ok2) ...
(Reading database ... 13653 files and directories currently installed.)
Preparing to unpack .../gpgv_2.4.3-ok11_amd64.deb ...
Unpacking gpgv (2.4.3-ok11) over (2.4.3-ok10) ...
Setting up gpgv (2.4.3-ok11) ...
(Reading database ... 13653 files and directories currently installed.)
Preparing to unpack .../optipng_0.7.8+ds-ok1_amd64.deb ...
Unpacking optipng (0.7.8+ds-ok1) over (0.7.8+ds-ok0) ...
(Reading database ... 13653 files and directories currently installed.)
Removing libpng16-16:amd64 (1.6.37-ok1) ...
Selecting previously unselected package libpng16-16t64:amd64.
(Reading database ... 13643 files and directories currently installed.)
Preparing to unpack .../libpng16-16t64_1.6.43-ok1_amd64.deb ...
Unpacking libpng16-16t64:amd64 (1.6.43-ok1) ...
Preparing to unpack .../libpam-modules-bin_1.5.3-ok7_amd64.deb ...
Unpacking libpam-modules-bin (1.5.3-ok7) over (1.5.3-ok4) ...
Setting up libpam-modules-bin (1.5.3-ok7) ...
(Reading database ... 13653 files and directories currently installed.)
Preparing to unpack .../libpam-modules_1.5.3-ok7_amd64.deb ...
Unpacking libpam-modules:amd64 (1.5.3-ok7) over (1.5.3-ok4) ...
Setting up libpam-modules:amd64 (1.5.3-ok7) ...
(Reading database ... 13652 files and directories currently installed.)
Preparing to unpack .../libpam-runtime_1.5.3-ok7_all.deb ...
Unpacking libpam-runtime (1.5.3-ok7) over (1.5.3-ok4) ...
Setting up libpam-runtime (1.5.3-ok7) ...
(Reading database ... 13649 files and directories currently installed.)
Preparing to unpack .../passwd_1%3a4.14.3-ok3.5_amd64.deb ...
Unpacking passwd (1:4.14.3-ok3.5) over (1:4.13+dfsg1-ok0) ...
Setting up passwd (1:4.14.3-ok3.5) ...
(Reading database ... 13645 files and directories currently installed.)
Preparing to unpack .../libffi8_3.4.6-ok2_amd64.deb ...
Unpacking libffi8:amd64 (3.4.6-ok2) over (3.4.6-ok1) ...
Setting up libffi8:amd64 (3.4.6-ok2) ...
(Reading database ... 13645 files and directories currently installed.)
Preparing to unpack .../00-mawk_1.3.4.20240123-ok1_amd64.deb ...
Unpacking mawk (1.3.4.20240123-ok1) over (1.3.4.20200120-ok1) ...
Preparing to unpack .../01-sensible-utils_0.0.22-ok1_all.deb ...
Unpacking sensible-utils (0.0.22-ok1) over (0.0.12-ok1) ...
Preparing to unpack .../02-fdisk_2.39.3-ok2build5_amd64.deb ...
Unpacking fdisk (2.39.3-ok2build5) over (2.39.3-ok2build4) ...
Preparing to unpack .../03-ubuntu-keyring_2023.11.28.1-ok1_all.deb ...
Unpacking ubuntu-keyring (2023.11.28.1-ok1) over (2020.02.11.2-ok2) ...
Preparing to unpack .../04-libgprofng0_2.41-ok13_amd64.deb ...
Unpacking libgprofng0:amd64 (2.41-ok13) over (2.41-5ok12) ...
Preparing to unpack .../05-libctf0_2.41-ok13_amd64.deb ...
Unpacking libctf0:amd64 (2.41-ok13) over (2.41-5ok12) ...
Preparing to unpack .../06-libctf-nobfd0_2.41-ok13_amd64.deb ...
Unpacking libctf-nobfd0:amd64 (2.41-ok13) over (2.41-5ok12) ...
Preparing to unpack .../07-binutils_2.41-ok13_amd64.deb ...
Unpacking binutils (2.41-ok13) over (2.41-5ok12) ...
Preparing to unpack .../08-binutils-x86-64-linux-gnu_2.41-ok13_amd64.deb ...
Unpacking binutils-x86-64-linux-gnu (2.41-ok13) over (2.41-5ok12) ...
Preparing to unpack .../09-libbinutils_2.41-ok13_amd64.deb ...
Unpacking libbinutils:amd64 (2.41-ok13) over (2.41-5ok12) ...
Preparing to unpack .../10-binutils-common_2.41-ok13_amd64.deb ...
Unpacking binutils-common:amd64 (2.41-ok13) over (2.41-5ok12) ...
Preparing to unpack .../11-libsframe1_2.41-ok13_amd64.deb ...
Unpacking libsframe1:amd64 (2.41-ok13) over (2.41-5ok12) ...
Preparing to unpack .../12-dpkg-dev_1.22.6-ok3_all.deb ...
Unpacking dpkg-dev (1.22.6-ok3) over (1.22.6-ok2) ...
Preparing to unpack .../13-libdpkg-perl_1.22.6-ok3_all.deb ...
Unpacking libdpkg-perl (1.22.6-ok3) over (1.22.6-ok2) ...
Preparing to unpack .../14-make_4.3-ok1_amd64.deb ...
Unpacking make (4.3-ok1) over (4.2.1-ok1) ...
Preparing to unpack .../15-lto-disabled-list_24-ok21_all.deb ...
Unpacking lto-disabled-list (24-ok21) over (24-ok20) ...
Preparing to unpack .../16-pkgbinarymangler_154-ok3_all.deb ...
Unpacking pkgbinarymangler (154-ok3) over (150-ok1) ...
Setting up lto-disabled-list (24-ok21) ...
Setting up libapparmor1:amd64 (4.0.0-beta3-ok1) ...
Setting up libsqlite3-0:amd64 (3.42.0-ok1) ...
Setting up binutils-common:amd64 (2.41-ok13) ...
Setting up linux-libc-dev:amd64 (6.6.0-15.0ok13) ...
Setting up libctf-nobfd0:amd64 (2.41-ok13) ...
Setting up systemd-dev (255.2-ok1.12) ...
Setting up ubuntu-keyring (2023.11.28.1-ok1) ...
Setting up libsframe1:amd64 (2.41-ok13) ...
Setting up make (4.3-ok1) ...
Setting up libpng16-16t64:amd64 (1.6.43-ok1) ...
Setting up libsystemd-shared:amd64 (255.2-ok1.12) ...
Setting up libdpkg-perl (1.22.6-ok3) ...
Setting up libfdisk1:amd64 (2.39.3-ok2build5) ...
Setting up mount (2.39.3-ok2build5) ...
Setting up sensible-utils (0.0.22-ok1) ...
Setting up libnsl2:amd64 (2.0.0-ok2) ...
Setting up gpgconf (2.4.3-ok11) ...
Setting up libcryptsetup12:amd64 (2:2.6.1-ok7) ...
Setting up mawk (1.3.4.20240123-ok1) ...
Setting up libbinutils:amd64 (2.41-ok13) ...
Setting up libc-dev-bin (2.38-1ok6.9) ...
Setting up openssl (3.2.1-ok7) ...
Setting up gpg (2.4.3-ok11) ...
Setting up util-linux-extra (2.39.3-ok2build5) ...
Setting up libctf0:amd64 (2.41-ok13) ...
Setting up gpg-agent (2.4.3-ok11) ...
Setting up systemd (255.2-ok1.12) ...
Setting up fdisk (2.39.3-ok2build5) ...
Setting up libgprofng0:amd64 (2.41-ok13) ...
Setting up optipng (0.7.8+ds-ok1) ...
Setting up systemd-timesyncd (255.2-ok1.12) ...
Installing new version of config file /etc/systemd/timesyncd.conf ...
Setting up libnsl-dev:amd64 (2.0.0-ok2) ...
Setting up libc6-dev:amd64 (2.38-1ok6.9) ...
Setting up binutils-x86-64-linux-gnu (2.41-ok13) ...
Setting up systemd-sysv (255.2-ok1.12) ...
Setting up pkgbinarymangler (154-ok3) ...
Installing new version of config file /etc/pkgbinarymangler/maintainermangler.overrides ...
Installing new version of config file /etc/pkgbinarymangler/striptranslations.blacklist ...
Setting up binutils (2.41-ok13) ...
Setting up dpkg-dev (1.22.6-ok3) ...
Processing triggers for libc-bin (2.38-1ok6.9) ...
(Reading database ... 13681 files and directories currently installed.)
Purging configuration files for libssl3:amd64 (3.2.1-ok1) ...
RUN: /usr/share/launchpad-buildd/bin/sbuild-package PACKAGEBUILD-288571 amd64 nile -c chroot:build-PACKAGEBUILD-288571 --arch=amd64 --dist=nile --nolog -A yhkylin-backup-tools_4.1.0.1-ok17.dsc
Initiating build PACKAGEBUILD-288571 with 16 jobs across 16 processor cores.
Kernel reported to sbuild: 5.4.0-126-generic #142-Ubuntu SMP Fri Aug 26 12:12:57 UTC 2022 x86_64
sbuild (Debian sbuild) 0.79.0 (05 February 2020) on 2f6cb779b462

+==============================================================================+
| yhkylin-backup-tools 4.1.0.1-ok17 (amd64)    Thu, 20 Mar 2025 09:26:11 +0000 |
+==============================================================================+

Package: yhkylin-backup-tools
Version: 4.1.0.1-ok17
Source Version: 4.1.0.1-ok17
Distribution: nile
Machine Architecture: amd64
Host Architecture: amd64
Build Architecture: amd64
Build Type: binary

I: NOTICE: Log filtering will replace 'home/buildd/build-PACKAGEBUILD-288571/chroot-autobuild' with '<<CHROOT>>'
I: NOTICE: Log filtering will replace 'build/yhkylin-backup-tools-prbnjr/resolver-xsPQZk' with '<<RESOLVERDIR>>'

+------------------------------------------------------------------------------+
| Fetch source files                                                           |
+------------------------------------------------------------------------------+


Local sources
-------------

yhkylin-backup-tools_4.1.0.1-ok17.dsc exists in .; copying to chroot
I: NOTICE: Log filtering will replace 'build/yhkylin-backup-tools-prbnjr/yhkylin-backup-tools-4.1.0.1' with '<<PKGBUILDDIR>>'
I: NOTICE: Log filtering will replace 'build/yhkylin-backup-tools-prbnjr' with '<<BUILDDIR>>'

+------------------------------------------------------------------------------+
| Install package build dependencies                                           |
+------------------------------------------------------------------------------+


Setup apt archive
-----------------

Merged Build-Depends: debhelper (>= 9), build-essential, qtbase5-dev (>= 5.1), qt5-qmake, qtchooser, qtscript5-dev, qttools5-dev-tools, qtbase5-dev-tools, qtbase5-private-dev, libblkid-dev, libkf5windowsystem-dev, libx11-dev, libqt5x11extras5-dev, libgsettings-qt-dev, libkysdk-qtwidgets-dev, libkysdk-waylandhelper-dev, libkysdk-systime-dev, build-essential, fakeroot
Filtered Build-Depends: debhelper (>= 9), build-essential, qtbase5-dev (>= 5.1), qt5-qmake, qtchooser, qtscript5-dev, qttools5-dev-tools, qtbase5-dev-tools, qtbase5-private-dev, libblkid-dev, libkf5windowsystem-dev, libx11-dev, libqt5x11extras5-dev, libgsettings-qt-dev, libkysdk-qtwidgets-dev, libkysdk-waylandhelper-dev, libkysdk-systime-dev, build-essential, fakeroot
dpkg-deb: building package 'sbuild-build-depends-main-dummy' in '/<<RESOLVERDIR>>/apt_archive/sbuild-build-depends-main-dummy.deb'.
Ign:1 copy:/<<RESOLVERDIR>>/apt_archive ./ InRelease
Get:2 copy:/<<RESOLVERDIR>>/apt_archive ./ Release [957 B]
Ign:3 copy:/<<RESOLVERDIR>>/apt_archive ./ Release.gpg
Get:4 copy:/<<RESOLVERDIR>>/apt_archive ./ Sources [491 B]
Get:5 copy:/<<RESOLVERDIR>>/apt_archive ./ Packages [570 B]
Fetched 2018 B in 0s (26.7 kB/s)
Reading package lists...
Reading package lists...

Install main build dependencies (apt-based resolver)
----------------------------------------------------

Installing build dependencies
Reading package lists...
Building dependency tree...
Reading state information...
The following packages were automatically installed and are no longer required:
  libffi7 libhogweed5 libip4tc2 libnettle7 lto-disabled-list systemd-timesyncd
  util-linux-extra
Use 'apt autoremove' to remove them.
The following additional packages will be installed:
  autoconf automake autopoint autotools-dev bsdextrautils dbus dbus-bin
  dbus-daemon dbus-session-bus-common dbus-system-bus-common debhelper
  dh-autoreconf dh-strip-nondeterminism dwz file fontconfig fontconfig-config
  fonts-dejavu-core gettext gettext-base gir1.2-glib-2.0 gir1.2-gudev-1.0
  groff-base intltool-debian kwayland-data libarchive-zip-perl
  libavahi-client3 libavahi-common-data libavahi-common3 libblkid-dev
  libbrotli-dev libbrotli1 libbz2-dev libclang1-15 libcups2t64 libdbus-1-3
  libdbus-glib-1-2 libdebhelper-perl libdouble-conversion3 libdrm-amdgpu1
  libdrm-common libdrm-intel1 libdrm-nouveau2 libdrm-radeon1 libdrm2 libedit2
  libegl-dev libegl-mesa0 libegl1 libelf1t64 libevdev-dev libevdev2 libexpat1
  libexpat1-dev libffi-dev libfile-stripnondeterminism-perl libfontconfig-dev
  libfontconfig1 libfreetype-dev libfreetype6 libgbm1 libgirepository-2.0-0
  libgl-dev libgl1 libgl1-mesa-dri libglapi-mesa libglib2.0-0t64
  libglib2.0-bin libglib2.0-data libglib2.0-dev libglib2.0-dev-bin
  libglu1-mesa libglu1-mesa-dev libglvnd0 libglx-dev libglx-mesa0 libglx0
  libgraphite2-3 libgsettings-qt-dev libgsettings-qt1 libgudev-1.0-0
  libgudev-1.0-dev libharfbuzz0b libice6 libicu70 libicu74 libinput-bin
  libinput-dev libinput10 libjpeg62-turbo libkf5waylandclient5
  libkf5windowsystem-data libkf5windowsystem-dev libkf5windowsystem5
  libkysdk-basecommon libkysdk-config libkysdk-config-dev libkysdk-log
  libkysdk-qtwidgets libkysdk-qtwidgets-dev libkysdk-systime
  libkysdk-systime-dev libkysdk-timer libkysdk-timer-dev libkysdk-utils
  libkysdk-utils-dev libkysdk-waylandhelper libkysdk-waylandhelper-dev
  libllvm15 libllvm17t64 libmagic-mgc libmagic1t64 libmd4c0 libmount-dev
  libmtdev-dev libmtdev1t64 libopengl-dev libopengl0 libpciaccess0
  libpcre2-16-0 libpcre2-32-0 libpcre2-dev libpcre2-posix3 libpipeline1
  libpkgconf4 libpng-dev libpopt0 libpthread-stubs0-dev libpython3-stdlib
  libpython3.12-minimal libpython3.12-stdlib libqt5concurrent5 libqt5core5a
  libqt5dbus5 libqt5designer5 libqt5designercomponents5 libqt5gui5 libqt5help5
  libqt5network5 libqt5printsupport5 libqt5qml5 libqt5qmlmodels5 libqt5quick5
  libqt5quickwidgets5 libqt5script5 libqt5scripttools5 libqt5sql5
  libqt5sql5-sqlite libqt5svg5 libqt5test5 libqt5widgets5 libqt5x11extras5
  libqt5x11extras5-dev libqt5xml5 libselinux1-dev libsensors-config
  libsensors5 libsepol-dev libsm6 libsub-override-perl libtool libuchardet0
  libudev-dev libvulkan-dev libvulkan1 libwacom-common libwacom-dev libwacom2
  libwayland-client0 libwayland-server0 libx11-6 libx11-data libx11-dev
  libx11-xcb1 libxau-dev libxau6 libxcb-dri2-0 libxcb-dri3-0 libxcb-glx0
  libxcb-icccm4 libxcb-image0 libxcb-keysyms1 libxcb-present0 libxcb-randr0
  libxcb-render-util0 libxcb-render0 libxcb-res0 libxcb-shape0 libxcb-shm0
  libxcb-sync1 libxcb-util1 libxcb-xfixes0 libxcb-xinerama0 libxcb-xinput0
  libxcb-xkb1 libxcb1 libxcb1-dev libxdmcp-dev libxdmcp6 libxext-dev libxext6
  libxfixes3 libxkbcommon-dev libxkbcommon-x11-0 libxkbcommon0 libxml2
  libxrender1 libxshmfence1 libxxf86vm1 libz3-4 logrotate m4 man-db
  media-types netbase pkgconf pkgconf-bin po-debconf python3 python3-minimal
  python3-packaging python3.12 python3.12-minimal qdoc-qt5 qhelpgenerator-qt5
  qt5-assistant qt5-qmake qt5-qmake-bin qtattributionsscanner-qt5 qtbase5-dev
  qtbase5-dev-tools qtbase5-private-dev qtchooser qtscript5-dev
  qttools5-dev-tools shared-mime-info ucf uuid-dev x11-common
  x11proto-core-dev x11proto-dev xkb-data xorg-sgml-doctools xtrans-dev
  zlib1g-dev
Suggested packages:
  autoconf-archive gnu-standards autoconf-doc default-dbus-session-bus
  | dbus-session-bus dh-make gettext-doc libasprintf-dev libgettextpo-dev
  groff cups-common libevdev-doc freetype2-doc low-memory-monitor
  gir1.2-glib-2.0-dev libglib2.0-doc libgdk-pixbuf2.0-bin libxml2-utils
  pciutils libthai0 qgnomeplatform-qt5 qt5-image-formats-plugins
  qt5-qmltooling-plugins lm-sensors libtool-doc gfortran | fortran95-compiler
  gcj-jdk libx11-doc libxcb-doc libxext-doc bsd-mailx | mailx m4-doc apparmor
  less www-browser libmail-box-perl python3-doc python3-tk python3-venv
  python3.12-venv python3.12-doc binfmt-support qt5-doc
  default-libmysqlclient-dev firebird-dev libpq-dev libsqlite3-dev
  unixodbc-dev libatspi2.0-dev libcups2-dev libdouble-conversion-dev
  libdrm-dev libharfbuzz-dev libicu-dev libqt5opengl5-dev libssl-dev
  libxcb-image0-dev libxcb-keysyms1-dev libxcb-randr0-dev libxcb-sync-dev
  libxcb-xfixes0-dev libxcb-xinerama0-dev libxcb-xkb-dev libxkbcommon-x11-dev
Recommended packages:
  curl | wget | lynx bzip2-doc libarchive-cpio-perl libgl1-amber-dri
  xdg-user-dirs libkf5windowsystem-doc kwayland-integration qtwayland5
  libpng-tools qttranslations5-l10n qt5-gtk-platformtheme libltdl-dev
  mesa-vulkan-drivers | vulkan-icd libwacom-bin libmail-sendmail-perl
  libqt5opengl5-dev
The following NEW packages will be installed:
  autoconf automake autopoint autotools-dev bsdextrautils dbus dbus-bin
  dbus-daemon dbus-session-bus-common dbus-system-bus-common debhelper
  dh-autoreconf dh-strip-nondeterminism dwz file fontconfig fontconfig-config
  fonts-dejavu-core gettext gettext-base gir1.2-glib-2.0 gir1.2-gudev-1.0
  groff-base intltool-debian kwayland-data libarchive-zip-perl
  libavahi-client3 libavahi-common-data libavahi-common3 libblkid-dev
  libbrotli-dev libbrotli1 libbz2-dev libclang1-15 libcups2t64 libdbus-1-3
  libdbus-glib-1-2 libdebhelper-perl libdouble-conversion3 libdrm-amdgpu1
  libdrm-common libdrm-intel1 libdrm-nouveau2 libdrm-radeon1 libdrm2 libedit2
  libegl-dev libegl-mesa0 libegl1 libelf1t64 libevdev-dev libevdev2 libexpat1
  libexpat1-dev libffi-dev libfile-stripnondeterminism-perl libfontconfig-dev
  libfontconfig1 libfreetype-dev libfreetype6 libgbm1 libgirepository-2.0-0
  libgl-dev libgl1 libgl1-mesa-dri libglapi-mesa libglib2.0-0t64
  libglib2.0-bin libglib2.0-data libglib2.0-dev libglib2.0-dev-bin
  libglu1-mesa libglu1-mesa-dev libglvnd0 libglx-dev libglx-mesa0 libglx0
  libgraphite2-3 libgsettings-qt-dev libgsettings-qt1 libgudev-1.0-0
  libgudev-1.0-dev libharfbuzz0b libice6 libicu70 libicu74 libinput-bin
  libinput-dev libinput10 libjpeg62-turbo libkf5waylandclient5
  libkf5windowsystem-data libkf5windowsystem-dev libkf5windowsystem5
  libkysdk-basecommon libkysdk-config libkysdk-config-dev libkysdk-log
  libkysdk-qtwidgets libkysdk-qtwidgets-dev libkysdk-systime
  libkysdk-systime-dev libkysdk-timer libkysdk-timer-dev libkysdk-utils
  libkysdk-utils-dev libkysdk-waylandhelper libkysdk-waylandhelper-dev
  libllvm15 libllvm17t64 libmagic-mgc libmagic1t64 libmd4c0 libmount-dev
  libmtdev-dev libmtdev1t64 libopengl-dev libopengl0 libpciaccess0
  libpcre2-16-0 libpcre2-32-0 libpcre2-dev libpcre2-posix3 libpipeline1
  libpkgconf4 libpng-dev libpopt0 libpthread-stubs0-dev libpython3-stdlib
  libpython3.12-minimal libpython3.12-stdlib libqt5concurrent5 libqt5core5a
  libqt5dbus5 libqt5designer5 libqt5designercomponents5 libqt5gui5 libqt5help5
  libqt5network5 libqt5printsupport5 libqt5qml5 libqt5qmlmodels5 libqt5quick5
  libqt5quickwidgets5 libqt5script5 libqt5scripttools5 libqt5sql5
  libqt5sql5-sqlite libqt5svg5 libqt5test5 libqt5widgets5 libqt5x11extras5
  libqt5x11extras5-dev libqt5xml5 libselinux1-dev libsensors-config
  libsensors5 libsepol-dev libsm6 libsub-override-perl libtool libuchardet0
  libudev-dev libvulkan-dev libvulkan1 libwacom-common libwacom-dev libwacom2
  libwayland-client0 libwayland-server0 libx11-6 libx11-data libx11-dev
  libx11-xcb1 libxau-dev libxau6 libxcb-dri2-0 libxcb-dri3-0 libxcb-glx0
  libxcb-icccm4 libxcb-image0 libxcb-keysyms1 libxcb-present0 libxcb-randr0
  libxcb-render-util0 libxcb-render0 libxcb-res0 libxcb-shape0 libxcb-shm0
  libxcb-sync1 libxcb-util1 libxcb-xfixes0 libxcb-xinerama0 libxcb-xinput0
  libxcb-xkb1 libxcb1 libxcb1-dev libxdmcp-dev libxdmcp6 libxext-dev libxext6
  libxfixes3 libxkbcommon-dev libxkbcommon-x11-0 libxkbcommon0 libxml2
  libxrender1 libxshmfence1 libxxf86vm1 libz3-4 logrotate m4 man-db
  media-types netbase pkgconf pkgconf-bin po-debconf python3 python3-minimal
  python3-packaging python3.12 python3.12-minimal qdoc-qt5 qhelpgenerator-qt5
  qt5-assistant qt5-qmake qt5-qmake-bin qtattributionsscanner-qt5 qtbase5-dev
  qtbase5-dev-tools qtbase5-private-dev qtchooser qtscript5-dev
  qttools5-dev-tools sbuild-build-depends-main-dummy shared-mime-info ucf
  uuid-dev x11-common x11proto-core-dev x11proto-dev xkb-data
  xorg-sgml-doctools xtrans-dev zlib1g-dev
0 upgraded, 246 newly installed, 0 to remove and 0 not upgraded.
Need to get 149 MB of archives.
After this operation, 675 MB of additional disk space will be used.
Get:1 copy:/<<RESOLVERDIR>>/apt_archive ./ sbuild-build-depends-main-dummy 0.invalid.0 [1004 B]
Get:2 http://archive.build.openkylin.top/openkylin nile/main amd64 libdbus-1-3 amd64 1.14.10-ok3 [193 kB]
Get:3 http://archive.build.openkylin.top/openkylin nile/main amd64 dbus-bin amd64 1.14.10-ok3 [36.4 kB]
Get:4 http://archive.build.openkylin.top/openkylin nile/main amd64 dbus-session-bus-common all 1.14.10-ok3 [72.5 kB]
Get:5 http://archive.build.openkylin.top/openkylin nile/main amd64 libexpat1 amd64 2.6.0-ok1 [83.5 kB]
Get:6 http://archive.build.openkylin.top/openkylin nile/main amd64 dbus-daemon amd64 1.14.10-ok3 [108 kB]
Get:7 http://archive.build.openkylin.top/openkylin nile/main amd64 dbus-system-bus-common all 1.14.10-ok3 [73.6 kB]
Get:8 http://archive.build.openkylin.top/openkylin nile/main amd64 dbus amd64 1.14.10-ok3 [22.2 kB]
Get:9 http://archive.build.openkylin.top/openkylin nile/main amd64 libglib2.0-0t64 amd64 2.80.0-ok1.2~1128 [1418 kB]
Get:10 http://archive.build.openkylin.top/openkylin nile/main amd64 libicu70 amd64 70.1-ok2 [10.4 MB]
Get:11 http://archive.build.openkylin.top/openkylin nile/main amd64 libxml2 amd64 2.9.14+dfsg-ok2 [704 kB]
Get:12 http://archive.build.openkylin.top/openkylin nile/main amd64 shared-mime-info amd64 2.2-ok6.1 [739 kB]
Get:13 http://archive.build.openkylin.top/openkylin nile/main amd64 libdouble-conversion3 amd64 3.3.0-ok1 [36.3 kB]
Get:14 http://archive.build.openkylin.top/openkylin nile/main amd64 libicu74 amd64 74.2-ok6 [9438 kB]
Get:15 http://archive.build.openkylin.top/openkylin nile/main amd64 libpcre2-16-0 amd64 10.42-4ok2 [197 kB]
Get:16 http://archive.build.openkylin.top/openkylin nile/main amd64 libqt5core5a amd64 5.15.10+dfsg-3ok2.13 [1810 kB]
Get:17 http://archive.build.openkylin.top/openkylin nile/main amd64 libqt5script5 amd64 5.15.10+dfsg-2ok1.3 [694 kB]
Get:18 http://archive.build.openkylin.top/openkylin nile/main amd64 libbrotli1 amd64 1.1.0-ok1 [290 kB]
Get:19 http://archive.build.openkylin.top/openkylin nile/main amd64 libfreetype6 amd64 2.13.2+dfsg-ok1 [365 kB]
Get:20 http://archive.build.openkylin.top/openkylin nile/main amd64 ucf all 3.0043+nmu1-ok1 [53.5 kB]
Get:21 http://archive.build.openkylin.top/openkylin nile/main amd64 fonts-dejavu-core all 2.37-ok1 [1040 kB]
Get:22 http://archive.build.openkylin.top/openkylin nile/main amd64 fontconfig-config all 2.15.0-ok5 [31.7 kB]
Get:23 http://archive.build.openkylin.top/openkylin nile/main amd64 libfontconfig1 amd64 2.15.0-ok5 [129 kB]
Get:24 http://archive.build.openkylin.top/openkylin nile/main amd64 fontconfig amd64 2.15.0-ok5 [180 kB]
Get:25 http://archive.build.openkylin.top/openkylin nile/main amd64 libdrm-common all 2.4.120-ok1 [5588 B]
Get:26 http://archive.build.openkylin.top/openkylin nile/main amd64 libdrm2 amd64 2.4.120-ok1 [36.4 kB]
Get:27 http://archive.build.openkylin.top/openkylin nile/main amd64 libglvnd0 amd64 1.7.0-ok1 [47.7 kB]
Get:28 http://archive.build.openkylin.top/openkylin nile/main amd64 libwayland-server0 amd64 1.23.0-1ok3 [32.0 kB]
Get:29 http://archive.build.openkylin.top/openkylin nile/main amd64 libxau6 amd64 1:1.0.9-ok1 [6348 B]
Get:30 http://archive.build.openkylin.top/openkylin nile/main amd64 libxdmcp6 amd64 1:1.1.3-ok1 [9268 B]
Get:31 http://archive.build.openkylin.top/openkylin nile/main amd64 libxcb1 amd64 1.15-ok2 [44.0 kB]
Get:32 http://archive.build.openkylin.top/openkylin nile/main amd64 libxcb-randr0 amd64 1.15-ok2 [16.7 kB]
Get:33 http://archive.build.openkylin.top/openkylin nile/main amd64 libgbm1 amd64 24.0.5-ok1 [29.4 kB]
Get:34 http://archive.build.openkylin.top/openkylin nile/main amd64 libglapi-mesa amd64 24.0.5-ok1 [25.0 kB]
Get:35 http://archive.build.openkylin.top/openkylin nile/main amd64 libwayland-client0 amd64 1.23.0-1ok3 [24.3 kB]
Get:36 http://archive.build.openkylin.top/openkylin nile/main amd64 libx11-data all 2:1.8.7-ok1 [104 kB]
Get:37 http://archive.build.openkylin.top/openkylin nile/main amd64 libx11-6 amd64 2:1.8.7-ok1 [577 kB]
Get:38 http://archive.build.openkylin.top/openkylin nile/main amd64 libx11-xcb1 amd64 2:1.8.7-ok1 [7556 B]
Get:39 http://archive.build.openkylin.top/openkylin nile/main amd64 libxcb-dri2-0 amd64 1.15-ok2 [6928 B]
Get:40 http://archive.build.openkylin.top/openkylin nile/main amd64 libxcb-dri3-0 amd64 1.15-ok2 [6804 B]
Get:41 http://archive.build.openkylin.top/openkylin nile/main amd64 libxcb-present0 amd64 1.15-ok2 [5524 B]
Get:42 http://archive.build.openkylin.top/openkylin nile/main amd64 libxcb-sync1 amd64 1.15-ok2 [8908 B]
Get:43 http://archive.build.openkylin.top/openkylin nile/main amd64 libxcb-xfixes0 amd64 1.15-ok2 [9424 B]
Get:44 http://archive.build.openkylin.top/openkylin nile/main amd64 libxshmfence1 amd64 1.3-ok1 [4424 B]
Get:45 http://archive.build.openkylin.top/openkylin nile/main amd64 libegl-mesa0 amd64 24.0.5-ok1 [107 kB]
Get:46 http://archive.build.openkylin.top/openkylin nile/main amd64 libegl1 amd64 1.7.0-ok1 [26.2 kB]
Get:47 http://archive.build.openkylin.top/openkylin nile/main amd64 libvulkan1 amd64 1.3.275.0-ok2 [131 kB]
Get:48 http://archive.build.openkylin.top/openkylin nile/main amd64 libdrm-amdgpu1 amd64 2.4.120-ok1 [18.8 kB]
Get:49 http://archive.build.openkylin.top/openkylin nile/main amd64 libpciaccess0 amd64 0.17-ok1 [17.0 kB]
Get:50 http://archive.build.openkylin.top/openkylin nile/main amd64 libdrm-intel1 amd64 2.4.120-ok1 [60.5 kB]
Get:51 http://archive.build.openkylin.top/openkylin nile/main amd64 libdrm-nouveau2 amd64 2.4.120-ok1 [16.6 kB]
Get:52 http://archive.build.openkylin.top/openkylin nile/main amd64 libdrm-radeon1 amd64 2.4.120-ok1 [19.6 kB]
Get:53 http://archive.build.openkylin.top/openkylin nile/main amd64 libelf1t64 amd64 0.190-ok3 [165 kB]
Get:54 http://archive.build.openkylin.top/openkylin nile/main amd64 libedit2 amd64 3.1-20230828-ok1 [95.3 kB]
Get:55 http://archive.build.openkylin.top/openkylin nile/main amd64 libllvm17t64 amd64 1:17.0.6-9ok4 [23.6 MB]
Get:56 http://archive.build.openkylin.top/openkylin nile/main amd64 libsensors-config all 1:3.6.0-ok1 [4392 B]
Get:57 http://archive.build.openkylin.top/openkylin nile/main amd64 libsensors5 amd64 1:3.6.0-ok1 [25.5 kB]
Get:58 http://archive.build.openkylin.top/openkylin nile/main amd64 libgl1-mesa-dri amd64 24.0.5-ok1 [8253 kB]
Get:59 http://archive.build.openkylin.top/openkylin nile/main amd64 libxcb-glx0 amd64 1.15-ok2 [22.3 kB]
Get:60 http://archive.build.openkylin.top/openkylin nile/main amd64 libxcb-shm0 amd64 1.15-ok2 [5544 B]
Get:61 http://archive.build.openkylin.top/openkylin nile/main amd64 libxext6 amd64 2:1.3.4-ok2 [30.1 kB]
Get:62 http://archive.build.openkylin.top/openkylin nile/main amd64 libxfixes3 amd64 1:6.0.0-ok1 [9896 B]
Get:63 http://archive.build.openkylin.top/openkylin nile/main amd64 libxxf86vm1 amd64 1:1.1.4-ok1 [8760 B]
Get:64 http://archive.build.openkylin.top/openkylin nile/main amd64 libglx-mesa0 amd64 24.0.5-ok1 [139 kB]
Get:65 http://archive.build.openkylin.top/openkylin nile/main amd64 libglx0 amd64 1.7.0-ok1 [31.8 kB]
Get:66 http://archive.build.openkylin.top/openkylin nile/main amd64 libgl1 amd64 1.7.0-ok1 [85.6 kB]
Get:67 http://archive.build.openkylin.top/openkylin nile/main amd64 libgraphite2-3 amd64 1.3.14-ok1 [66.5 kB]
Get:68 http://archive.build.openkylin.top/openkylin nile/main amd64 libharfbuzz0b amd64 8.3.0-ok2 [431 kB]
Get:69 http://archive.build.openkylin.top/openkylin nile/main amd64 x11-common all 1:7.7+23-ok1 [20.8 kB]
Get:70 http://archive.build.openkylin.top/openkylin nile/main amd64 libice6 amd64 2:1.0.10-ok1 [38.5 kB]
Get:71 http://archive.build.openkylin.top/openkylin nile/main amd64 libevdev2 amd64 1.13.1+dfsg-ok1 [30.7 kB]
Get:72 http://archive.build.openkylin.top/openkylin nile/main amd64 libmtdev1t64 amd64 1.1.6-ok1 [13.0 kB]
Get:73 http://archive.build.openkylin.top/openkylin nile/main amd64 libgudev-1.0-0 amd64 1:238-ok2 [13.3 kB]
Get:74 http://archive.build.openkylin.top/openkylin nile/main amd64 libwacom-common all 1.3-ok3.2 [44.1 kB]
Get:75 http://archive.build.openkylin.top/openkylin nile/main amd64 libwacom2 amd64 1.3-ok3.2 [19.9 kB]
Get:76 http://archive.build.openkylin.top/openkylin nile/main amd64 libinput-bin amd64 1.25.0-ok1.2 [19.1 kB]
Get:77 http://archive.build.openkylin.top/openkylin nile/main amd64 libinput10 amd64 1.25.0-ok1.2 [126 kB]
Get:78 http://archive.build.openkylin.top/openkylin nile/main amd64 libjpeg62-turbo amd64 1:2.1.2-ok2 [151 kB]
Get:79 http://archive.build.openkylin.top/openkylin nile/main amd64 libmd4c0 amd64 0.4.8-ok1 [38.7 kB]
Get:80 http://archive.build.openkylin.top/openkylin nile/main amd64 libqt5dbus5 amd64 5.15.10+dfsg-3ok2.13 [203 kB]
Get:81 http://archive.build.openkylin.top/openkylin nile/main amd64 libqt5network5 amd64 5.15.10+dfsg-3ok2.13 [666 kB]
Get:82 http://archive.build.openkylin.top/openkylin nile/main amd64 libsm6 amd64 2:1.2.3-ok1 [14.3 kB]
Get:83 http://archive.build.openkylin.top/openkylin nile/main amd64 libxcb-icccm4 amd64 0.4.1-ok1 [9652 B]
Get:84 http://archive.build.openkylin.top/openkylin nile/main amd64 libxcb-util1 amd64 0.4.0-ok2 [11.6 kB]
Get:85 http://archive.build.openkylin.top/openkylin nile/main amd64 libxcb-image0 amd64 0.4.0-ok1 [11.1 kB]
Get:86 http://archive.build.openkylin.top/openkylin nile/main amd64 libxcb-keysyms1 amd64 0.4.0-ok1 [7376 B]
Get:87 http://archive.build.openkylin.top/openkylin nile/main amd64 libxcb-render0 amd64 1.15-ok2 [15.1 kB]
Get:88 http://archive.build.openkylin.top/openkylin nile/main amd64 libxcb-render-util0 amd64 0.3.9-ok1 [8948 B]
Get:89 http://archive.build.openkylin.top/openkylin nile/main amd64 libxcb-shape0 amd64 1.15-ok2 [5856 B]
Get:90 http://archive.build.openkylin.top/openkylin nile/main amd64 libxcb-xinerama0 amd64 1.15-ok2 [5200 B]
Get:91 http://archive.build.openkylin.top/openkylin nile/main amd64 libxcb-xinput0 amd64 1.15-ok2 [30.9 kB]
Get:92 http://archive.build.openkylin.top/openkylin nile/main amd64 libxcb-xkb1 amd64 1.15-ok2 [29.7 kB]
Get:93 http://archive.build.openkylin.top/openkylin nile/main amd64 xkb-data all 2.41-ok1 [794 kB]
Get:94 http://archive.build.openkylin.top/openkylin nile/main amd64 libxkbcommon0 amd64 1.5.0-ok1 [108 kB]
Get:95 http://archive.build.openkylin.top/openkylin nile/main amd64 libxkbcommon-x11-0 amd64 1.5.0-ok1 [15.7 kB]
Get:96 http://archive.build.openkylin.top/openkylin nile/main amd64 libxrender1 amd64 1:0.9.10-ok1 [17.1 kB]
Get:97 http://archive.build.openkylin.top/openkylin nile/main amd64 libqt5gui5 amd64 5.15.10+dfsg-3ok2.13 [3405 kB]
Get:98 http://archive.build.openkylin.top/openkylin nile/main amd64 libqt5widgets5 amd64 5.15.10+dfsg-3ok2.13 [2375 kB]
Get:99 http://archive.build.openkylin.top/openkylin nile/main amd64 libqt5scripttools5 amd64 5.15.10+dfsg-2ok1.3 [209 kB]
Get:100 http://archive.build.openkylin.top/openkylin nile/main amd64 libpython3.12-minimal amd64 3.12.2-ok4.1 [799 kB]
Get:101 http://archive.build.openkylin.top/openkylin nile/main amd64 python3.12-minimal amd64 3.12.2-ok4.1 [2198 kB]
Get:102 http://archive.build.openkylin.top/openkylin nile/main amd64 python3-minimal amd64 3.12.2-ok1 [23.2 kB]
Get:103 http://archive.build.openkylin.top/openkylin nile/main amd64 media-types all 10.1.0-ok1 [20.0 kB]
Get:104 http://archive.build.openkylin.top/openkylin nile/main amd64 netbase all 6.4-ok1 [10.6 kB]
Get:105 http://archive.build.openkylin.top/openkylin nile/main amd64 libpython3.12-stdlib amd64 3.12.2-ok4.1 [1927 kB]
Get:106 http://archive.build.openkylin.top/openkylin nile/main amd64 python3.12 amd64 3.12.2-ok4.1 [644 kB]
Get:107 http://archive.build.openkylin.top/openkylin nile/main amd64 libpython3-stdlib amd64 3.12.2-ok1 [6252 B]
Get:108 http://archive.build.openkylin.top/openkylin nile/main amd64 python3 amd64 3.12.2-ok1 [22.8 kB]
Get:109 http://archive.build.openkylin.top/openkylin nile/main amd64 xorg-sgml-doctools all 1:1.11-ok1 [9766 B]
Get:110 http://archive.build.openkylin.top/openkylin nile/main amd64 x11proto-dev all 2024.1-1ok3 [603 kB]
Get:111 http://archive.build.openkylin.top/openkylin nile/main amd64 x11proto-core-dev all 2024.1-1ok3 [2616 B]
Get:112 http://archive.build.openkylin.top/openkylin nile/main amd64 libxau-dev amd64 1:1.0.9-ok1 [9548 B]
Get:113 http://archive.build.openkylin.top/openkylin nile/main amd64 libxdmcp-dev amd64 1:1.1.3-ok1 [25.3 kB]
Get:114 http://archive.build.openkylin.top/openkylin nile/main amd64 xtrans-dev all 1.4.0-ok1 [68.5 kB]
Get:115 http://archive.build.openkylin.top/openkylin nile/main amd64 libpthread-stubs0-dev amd64 0.4-ok2 [4254 B]
Get:116 http://archive.build.openkylin.top/openkylin nile/main amd64 libxcb1-dev amd64 1.15-ok2 [80.8 kB]
Get:117 http://archive.build.openkylin.top/openkylin nile/main amd64 libx11-dev amd64 2:1.8.7-ok1 [647 kB]
Get:118 http://archive.build.openkylin.top/openkylin nile/main amd64 libglx-dev amd64 1.7.0-ok1 [14.0 kB]
Get:119 http://archive.build.openkylin.top/openkylin nile/main amd64 libgl-dev amd64 1.7.0-ok1 [98.8 kB]
Get:120 http://archive.build.openkylin.top/openkylin nile/main amd64 libegl-dev amd64 1.7.0-ok1 [17.7 kB]
Get:121 http://archive.build.openkylin.top/openkylin nile/main amd64 libopengl0 amd64 1.7.0-ok1 [29.0 kB]
Get:122 http://archive.build.openkylin.top/openkylin nile/main amd64 libglu1-mesa amd64 9.0.2-ok1 [139 kB]
Get:123 http://archive.build.openkylin.top/openkylin nile/main amd64 libopengl-dev amd64 1.7.0-ok1 [3592 B]
Get:124 http://archive.build.openkylin.top/openkylin nile/main amd64 libglu1-mesa-dev amd64 9.0.2-ok1 [215 kB]
Get:125 http://archive.build.openkylin.top/openkylin nile/main amd64 libqt5concurrent5 amd64 5.15.10+dfsg-3ok2.13 [34.0 kB]
Get:126 http://archive.build.openkylin.top/openkylin nile/main amd64 libavahi-common-data amd64 0.8-ok1 [106 kB]
Get:127 http://archive.build.openkylin.top/openkylin nile/main amd64 libavahi-common3 amd64 0.8-ok1 [21.9 kB]
Get:128 http://archive.build.openkylin.top/openkylin nile/main amd64 libavahi-client3 amd64 0.8-ok1 [25.5 kB]
Get:129 http://archive.build.openkylin.top/openkylin nile/main amd64 libcups2t64 amd64 2.4.7-ok2 [243 kB]
Get:130 http://archive.build.openkylin.top/openkylin nile/main amd64 libqt5printsupport5 amd64 5.15.10+dfsg-3ok2.13 [194 kB]
Get:131 http://archive.build.openkylin.top/openkylin nile/main amd64 libqt5sql5 amd64 5.15.10+dfsg-3ok2.13 [114 kB]
Get:132 http://archive.build.openkylin.top/openkylin nile/main amd64 libqt5test5 amd64 5.15.10+dfsg-3ok2.13 [137 kB]
Get:133 http://archive.build.openkylin.top/openkylin nile/main amd64 libqt5xml5 amd64 5.15.10+dfsg-3ok2.13 [113 kB]
Get:134 http://archive.build.openkylin.top/openkylin nile/main amd64 libvulkan-dev amd64 1.3.275.0-ok2 [1308 kB]
Get:135 http://archive.build.openkylin.top/openkylin nile/main amd64 libxext-dev amd64 2:1.3.4-ok2 [84.7 kB]
Get:136 http://archive.build.openkylin.top/openkylin nile/main amd64 qt5-qmake-bin amd64 5.15.10+dfsg-3ok2.13 [986 kB]
Get:137 http://archive.build.openkylin.top/openkylin nile/main amd64 qtchooser amd64 66-ok2 [22.9 kB]
Get:138 http://archive.build.openkylin.top/openkylin nile/main amd64 qt5-qmake amd64 5.15.10+dfsg-3ok2.13 [205 kB]
Get:139 http://archive.build.openkylin.top/openkylin nile/main amd64 qtbase5-dev-tools amd64 5.15.10+dfsg-3ok2.13 [738 kB]
Get:140 http://archive.build.openkylin.top/openkylin nile/main amd64 qtbase5-dev amd64 5.15.10+dfsg-3ok2.13 [1096 kB]
Get:141 http://archive.build.openkylin.top/openkylin nile/main amd64 qtscript5-dev amd64 5.15.10+dfsg-2ok1.3 [18.5 kB]
Get:142 http://archive.build.openkylin.top/openkylin nile/main amd64 libuchardet0 amd64 0.0.8-ok1 [65.9 kB]
Get:143 http://archive.build.openkylin.top/openkylin nile/main amd64 groff-base amd64 1.23.0-3ok1 [903 kB]
Get:144 http://archive.build.openkylin.top/openkylin nile/main amd64 libpopt0 amd64 1.19+dfsg-1ok1.0 [48.0 kB]
Get:145 http://archive.build.openkylin.top/openkylin nile/main amd64 logrotate amd64 3.21.0-ok1 [48.0 kB]
Get:146 http://archive.build.openkylin.top/openkylin nile/main amd64 bsdextrautils amd64 2.39.3-ok2build5 [67.3 kB]
Get:147 http://archive.build.openkylin.top/openkylin nile/main amd64 libpipeline1 amd64 1.5.7-ok1 [21.2 kB]
Get:148 http://archive.build.openkylin.top/openkylin nile/main amd64 man-db amd64 2.12.0-ok1 [1315 kB]
Get:149 http://archive.build.openkylin.top/openkylin nile/main amd64 libmagic-mgc amd64 1:5.45-ok1 [292 kB]
Get:150 http://archive.build.openkylin.top/openkylin nile/main amd64 libmagic1t64 amd64 1:5.45-ok1 [81.8 kB]
Get:151 http://archive.build.openkylin.top/openkylin nile/main amd64 file amd64 1:5.45-ok1 [20.4 kB]
Get:152 http://archive.build.openkylin.top/openkylin nile/main amd64 gettext-base amd64 0.22-ok3 [79.6 kB]
Get:153 http://archive.build.openkylin.top/openkylin nile/main amd64 m4 amd64 1.4.19-ok1 [262 kB]
Get:154 http://archive.build.openkylin.top/openkylin nile/main amd64 autoconf all 2.71-ok3 [385 kB]
Get:155 http://archive.build.openkylin.top/openkylin nile/main amd64 autotools-dev all 20220506-ok1 [41.6 kB]
Get:156 http://archive.build.openkylin.top/openkylin nile/main amd64 automake all 1:1.16.5-ok1 [557 kB]
Get:157 http://archive.build.openkylin.top/openkylin nile/main amd64 autopoint all 0.22-ok3 [424 kB]
Get:158 http://archive.build.openkylin.top/openkylin nile/main amd64 libdebhelper-perl all 13.15.3-ok1 [66.0 kB]
Get:159 http://archive.build.openkylin.top/openkylin nile/main amd64 libtool all 2.4.7-ok2 [164 kB]
Get:160 http://archive.build.openkylin.top/openkylin nile/main amd64 dh-autoreconf all 20-ok1 [16.3 kB]
Get:161 http://archive.build.openkylin.top/openkylin nile/main amd64 libarchive-zip-perl all 1.68-ok1 [90.7 kB]
Get:162 http://archive.build.openkylin.top/openkylin nile/main amd64 libsub-override-perl all 0.10-ok1 [9172 B]
Get:163 http://archive.build.openkylin.top/openkylin nile/main amd64 libfile-stripnondeterminism-perl all 1.13.1-ok1 [16.3 kB]
Get:164 http://archive.build.openkylin.top/openkylin nile/main amd64 dh-strip-nondeterminism all 1.13.1-ok1 [5324 B]
Get:165 http://archive.build.openkylin.top/openkylin nile/main amd64 dwz amd64 0.15-1ok1 [113 kB]
Get:166 http://archive.build.openkylin.top/openkylin nile/main amd64 gettext amd64 0.22-ok3 [1224 kB]
Get:167 http://archive.build.openkylin.top/openkylin nile/main amd64 intltool-debian all 0.35.0+20060710.5-ok2 [23.2 kB]
Get:168 http://archive.build.openkylin.top/openkylin nile/main amd64 po-debconf all 1.0.21+nmu1-ok1 [227 kB]
Get:169 http://archive.build.openkylin.top/openkylin nile/main amd64 debhelper all 13.15.3-ok1 [959 kB]
Get:170 http://archive.build.openkylin.top/openkylin nile/main amd64 gir1.2-glib-2.0 amd64 2.80.0-ok1.2~1128 [159 kB]
Get:171 http://archive.build.openkylin.top/openkylin nile/main amd64 gir1.2-gudev-1.0 amd64 1:238-ok2 [3740 B]
Get:172 http://archive.build.openkylin.top/openkylin nile/main amd64 kwayland-data all 4:5.92.0-ok4.3 [4480 B]
Get:173 http://archive.build.openkylin.top/openkylin nile/main amd64 uuid-dev amd64 2.39.3-ok2build5 [31.7 kB]
Get:174 http://archive.build.openkylin.top/openkylin nile/main amd64 libblkid-dev amd64 2.39.3-ok2build5 [183 kB]
Get:175 http://archive.build.openkylin.top/openkylin nile/main amd64 libbrotli-dev amd64 1.1.0-ok1 [309 kB]
Get:176 http://archive.build.openkylin.top/openkylin nile/main amd64 libbz2-dev amd64 1.0.8.2-0k0 [32.3 kB]
Get:177 http://archive.build.openkylin.top/openkylin nile/main amd64 libz3-4 amd64 4.8.12-ok1 [5366 kB]
Get:178 http://archive.build.openkylin.top/openkylin nile/main amd64 libllvm15 amd64 1:15.0.7-ok3 [25.2 MB]
Get:179 http://archive.build.openkylin.top/openkylin nile/main amd64 libclang1-15 amd64 1:15.0.7-ok3 [6917 kB]
Get:180 http://archive.build.openkylin.top/openkylin nile/main amd64 libdbus-glib-1-2 amd64 0.112-ok1 [59.1 kB]
Get:181 http://archive.build.openkylin.top/openkylin nile/main amd64 libevdev-dev amd64 1.13.1+dfsg-ok1 [48.5 kB]
Get:182 http://archive.build.openkylin.top/openkylin nile/main amd64 libexpat1-dev amd64 2.6.0-ok1 [141 kB]
Get:183 http://archive.build.openkylin.top/openkylin nile/main amd64 libffi-dev amd64 3.4.6-ok2 [65.9 kB]
Get:184 http://archive.build.openkylin.top/openkylin nile/main amd64 zlib1g-dev amd64 1:1.3.dfsg-ok3 [890 kB]
Get:185 http://archive.build.openkylin.top/openkylin nile/main amd64 libpng-dev amd64 1.6.43-ok1 [250 kB]
Get:186 http://archive.build.openkylin.top/openkylin nile/main amd64 libfreetype-dev amd64 2.13.2+dfsg-ok1 [531 kB]
Get:187 http://archive.build.openkylin.top/openkylin nile/main amd64 libpkgconf4 amd64 1.9.5-ok1 [29.5 kB]
Get:188 http://archive.build.openkylin.top/openkylin nile/main amd64 pkgconf-bin amd64 1.9.5-ok1 [22.6 kB]
Get:189 http://archive.build.openkylin.top/openkylin nile/main amd64 pkgconf amd64 1.9.5-ok1 [16.5 kB]
Get:190 http://archive.build.openkylin.top/openkylin nile/main amd64 libfontconfig-dev amd64 2.15.0-ok5 [754 kB]
Get:191 http://archive.build.openkylin.top/openkylin nile/main amd64 libgirepository-2.0-0 amd64 2.80.0-ok1.2~1128 [68.6 kB]
Get:192 http://archive.build.openkylin.top/openkylin nile/main amd64 libglib2.0-data all 2.80.0-ok1.2~1128 [1050 kB]
Get:193 http://archive.build.openkylin.top/openkylin nile/main amd64 libglib2.0-bin amd64 2.80.0-ok1.2~1128 [89.5 kB]
Get:194 http://archive.build.openkylin.top/openkylin nile/main amd64 python3-packaging all 24.0-ok1 [39.6 kB]
Get:195 http://archive.build.openkylin.top/openkylin nile/main amd64 libglib2.0-dev-bin amd64 2.80.0-ok1.2~1128 [135 kB]
Get:196 http://archive.build.openkylin.top/openkylin nile/main amd64 libsepol-dev amd64 3.5-ok1 [385 kB]
Get:197 http://archive.build.openkylin.top/openkylin nile/main amd64 libpcre2-32-0 amd64 10.42-4ok2 [184 kB]
Get:198 http://archive.build.openkylin.top/openkylin nile/main amd64 libpcre2-posix3 amd64 10.42-4ok2 [6408 B]
Get:199 http://archive.build.openkylin.top/openkylin nile/main amd64 libpcre2-dev amd64 10.42-4ok2 [693 kB]
Get:200 http://archive.build.openkylin.top/openkylin nile/main amd64 libselinux1-dev amd64 3.5-ok2 [153 kB]
Get:201 http://archive.build.openkylin.top/openkylin nile/main amd64 libmount-dev amd64 2.39.3-ok2build5 [14.4 kB]
Get:202 http://archive.build.openkylin.top/openkylin nile/main amd64 libglib2.0-dev amd64 2.80.0-ok1.2~1128 [1691 kB]
Get:203 http://archive.build.openkylin.top/openkylin nile/main amd64 libgsettings-qt1 amd64 0.2-ok1 [17.2 kB]
Get:204 http://archive.build.openkylin.top/openkylin nile/main amd64 libgsettings-qt-dev amd64 0.2-ok1 [3320 B]
Get:205 http://archive.build.openkylin.top/openkylin nile-proposed/main amd64 libudev-dev amd64 255.2-ok1.12 [21.9 kB]
Get:206 http://archive.build.openkylin.top/openkylin nile/main amd64 libgudev-1.0-dev amd64 1:238-ok2 [27.3 kB]
Get:207 http://archive.build.openkylin.top/openkylin nile/main amd64 libmtdev-dev amd64 1.1.6-ok1 [5188 B]
Get:208 http://archive.build.openkylin.top/openkylin nile/main amd64 libwacom-dev amd64 1.3-ok3.2 [6874 B]
Get:209 http://archive.build.openkylin.top/openkylin nile/main amd64 libinput-dev amd64 1.25.0-ok1.2 [32.0 kB]
Get:210 http://archive.build.openkylin.top/openkylin nile/main amd64 libkf5waylandclient5 amd64 4:5.92.0-ok4.3 [195 kB]
Get:211 http://archive.build.openkylin.top/openkylin nile/main amd64 libkf5windowsystem-data all 5.92.0-ok5.3 [10.0 kB]
Get:212 http://archive.build.openkylin.top/openkylin nile/main amd64 libqt5x11extras5 amd64 5.15.10-2ok1 [10.3 kB]
Get:213 http://archive.build.openkylin.top/openkylin nile/main amd64 libxcb-res0 amd64 1.15-ok2 [6372 B]
Get:214 http://archive.build.openkylin.top/openkylin nile/main amd64 libkf5windowsystem5 amd64 5.92.0-ok5.3 [136 kB]
Get:215 http://archive.build.openkylin.top/openkylin nile/main amd64 libkf5windowsystem-dev amd64 5.92.0-ok5.3 [46.1 kB]
Get:216 http://archive.build.openkylin.top/openkylin nile/main amd64 libkysdk-basecommon amd64 2.5.1.0-0k0.6 [3492 B]
Get:217 http://archive.build.openkylin.top/openkylin nile/main amd64 libkysdk-utils amd64 2.5.1.0-0k0.6 [7964 B]
Get:218 http://archive.build.openkylin.top/openkylin nile/main amd64 libkysdk-config amd64 2.5.1.0-0k0.6 [7816 B]
Get:219 http://archive.build.openkylin.top/openkylin nile/main amd64 libkysdk-utils-dev all 2.5.1.0-0k0.6 [28.8 kB]
Get:220 http://archive.build.openkylin.top/openkylin nile/main amd64 libkysdk-config-dev all 2.5.1.0-0k0.6 [11.9 kB]
Get:221 http://archive.build.openkylin.top/openkylin nile/main amd64 libkysdk-log amd64 2.5.1.0-0k0.6 [14.4 kB]
Get:222 http://archive.build.openkylin.top/openkylin nile/main amd64 libkysdk-waylandhelper amd64 2.5.1.0-0k9.1 [106 kB]
Get:223 http://archive.build.openkylin.top/openkylin nile/main amd64 libqt5svg5 amd64 5.15.10-2ok1 [152 kB]
Get:224 http://archive.build.openkylin.top/openkylin nile/main amd64 libkysdk-qtwidgets amd64 2.5.1.0-0k9.1 [447 kB]
Get:225 http://archive.build.openkylin.top/openkylin nile/main amd64 libkysdk-qtwidgets-dev amd64 2.5.1.0-0k9.1 [31.7 kB]
Get:226 http://archive.build.openkylin.top/openkylin nile/main amd64 libkysdk-timer amd64 2.5.1.0-0k0.6 [5900 B]
Get:227 http://archive.build.openkylin.top/openkylin nile/main amd64 libkysdk-systime amd64 2.5.1.2-0k1.8 [37.6 kB]
Get:228 http://archive.build.openkylin.top/openkylin nile/main amd64 libkysdk-timer-dev all 2.5.1.0-0k0.6 [11.7 kB]
Get:229 http://archive.build.openkylin.top/openkylin nile/main amd64 libkysdk-systime-dev all 2.5.1.2-0k1.8 [38.5 kB]
Get:230 http://archive.build.openkylin.top/openkylin nile/main amd64 libkysdk-waylandhelper-dev amd64 2.5.1.0-0k9.1 [29.6 kB]
Get:231 http://archive.build.openkylin.top/openkylin nile/main amd64 libqt5designer5 amd64 5.15.10-5ok1.5 [2747 kB]
Get:232 http://archive.build.openkylin.top/openkylin nile/main amd64 libqt5designercomponents5 amd64 5.15.10-5ok1.5 [728 kB]
Get:233 http://archive.build.openkylin.top/openkylin nile/main amd64 libqt5help5 amd64 5.15.10-5ok1.5 [148 kB]
Get:234 http://archive.build.openkylin.top/openkylin nile/main amd64 libqt5qml5 amd64 5.15.10+dfsg-2ok1.5 [1356 kB]
Get:235 http://archive.build.openkylin.top/openkylin nile/main amd64 libqt5qmlmodels5 amd64 5.15.10+dfsg-2ok1.5 [185 kB]
Get:236 http://archive.build.openkylin.top/openkylin nile/main amd64 libqt5quick5 amd64 5.15.10+dfsg-2ok1.5 [1589 kB]
Get:237 http://archive.build.openkylin.top/openkylin nile/main amd64 libqt5quickwidgets5 amd64 5.15.10+dfsg-2ok1.5 [35.8 kB]
Get:238 http://archive.build.openkylin.top/openkylin nile/main amd64 libqt5sql5-sqlite amd64 5.15.10+dfsg-3ok2.13 [48.7 kB]
Get:239 http://archive.build.openkylin.top/openkylin nile/main amd64 libqt5x11extras5-dev amd64 5.15.10-2ok1 [8694 B]
Get:240 http://archive.build.openkylin.top/openkylin nile/main amd64 libxkbcommon-dev amd64 1.5.0-ok1 [54.5 kB]
Get:241 http://archive.build.openkylin.top/openkylin nile/main amd64 qdoc-qt5 amd64 5.15.10-5ok1.5 [574 kB]
Get:242 http://archive.build.openkylin.top/openkylin nile/main amd64 qhelpgenerator-qt5 amd64 5.15.10-5ok1.5 [54.9 kB]
Get:243 http://archive.build.openkylin.top/openkylin nile/main amd64 qt5-assistant amd64 5.15.10-5ok1.5 [347 kB]
Get:244 http://archive.build.openkylin.top/openkylin nile/main amd64 qtattributionsscanner-qt5 amd64 5.15.10-5ok1.5 [31.1 kB]
Get:245 http://archive.build.openkylin.top/openkylin nile/main amd64 qtbase5-private-dev amd64 5.15.10+dfsg-3ok2.13 [1295 kB]
Get:246 http://archive.build.openkylin.top/openkylin nile/main amd64 qttools5-dev-tools amd64 5.15.10-5ok1.5 [1011 kB]
debconf: delaying package configuration, since apt-utils is not installed
Fetched 149 MB in 14s (10.9 MB/s)
Selecting previously unselected package libdbus-1-3:amd64.
(Reading database ... 13681 files and directories currently installed.)
Preparing to unpack .../00-libdbus-1-3_1.14.10-ok3_amd64.deb ...
Unpacking libdbus-1-3:amd64 (1.14.10-ok3) ...
Selecting previously unselected package dbus-bin.
Preparing to unpack .../01-dbus-bin_1.14.10-ok3_amd64.deb ...
Unpacking dbus-bin (1.14.10-ok3) ...
Selecting previously unselected package dbus-session-bus-common.
Preparing to unpack .../02-dbus-session-bus-common_1.14.10-ok3_all.deb ...
Unpacking dbus-session-bus-common (1.14.10-ok3) ...
Selecting previously unselected package libexpat1:amd64.
Preparing to unpack .../03-libexpat1_2.6.0-ok1_amd64.deb ...
Unpacking libexpat1:amd64 (2.6.0-ok1) ...
Selecting previously unselected package dbus-daemon.
Preparing to unpack .../04-dbus-daemon_1.14.10-ok3_amd64.deb ...
Unpacking dbus-daemon (1.14.10-ok3) ...
Selecting previously unselected package dbus-system-bus-common.
Preparing to unpack .../05-dbus-system-bus-common_1.14.10-ok3_all.deb ...
Unpacking dbus-system-bus-common (1.14.10-ok3) ...
Selecting previously unselected package dbus.
Preparing to unpack .../06-dbus_1.14.10-ok3_amd64.deb ...
Unpacking dbus (1.14.10-ok3) ...
Selecting previously unselected package libglib2.0-0t64:amd64.
Preparing to unpack .../07-libglib2.0-0t64_2.80.0-ok1.2~1128_amd64.deb ...
Unpacking libglib2.0-0t64:amd64 (2.80.0-ok1.2~1128) ...
Selecting previously unselected package libicu70:amd64.
Preparing to unpack .../08-libicu70_70.1-ok2_amd64.deb ...
Unpacking libicu70:amd64 (70.1-ok2) ...
Selecting previously unselected package libxml2:amd64.
Preparing to unpack .../09-libxml2_2.9.14+dfsg-ok2_amd64.deb ...
Unpacking libxml2:amd64 (2.9.14+dfsg-ok2) ...
Selecting previously unselected package shared-mime-info.
Preparing to unpack .../10-shared-mime-info_2.2-ok6.1_amd64.deb ...
Unpacking shared-mime-info (2.2-ok6.1) ...
Selecting previously unselected package libdouble-conversion3:amd64.
Preparing to unpack .../11-libdouble-conversion3_3.3.0-ok1_amd64.deb ...
Unpacking libdouble-conversion3:amd64 (3.3.0-ok1) ...
Selecting previously unselected package libicu74:amd64.
Preparing to unpack .../12-libicu74_74.2-ok6_amd64.deb ...
Unpacking libicu74:amd64 (74.2-ok6) ...
Selecting previously unselected package libpcre2-16-0:amd64.
Preparing to unpack .../13-libpcre2-16-0_10.42-4ok2_amd64.deb ...
Unpacking libpcre2-16-0:amd64 (10.42-4ok2) ...
Selecting previously unselected package libqt5core5a:amd64.
Preparing to unpack .../14-libqt5core5a_5.15.10+dfsg-3ok2.13_amd64.deb ...
Unpacking libqt5core5a:amd64 (5.15.10+dfsg-3ok2.13) ...
Selecting previously unselected package libqt5script5:amd64.
Preparing to unpack .../15-libqt5script5_5.15.10+dfsg-2ok1.3_amd64.deb ...
Unpacking libqt5script5:amd64 (5.15.10+dfsg-2ok1.3) ...
Selecting previously unselected package libbrotli1:amd64.
Preparing to unpack .../16-libbrotli1_1.1.0-ok1_amd64.deb ...
Unpacking libbrotli1:amd64 (1.1.0-ok1) ...
Selecting previously unselected package libfreetype6:amd64.
Preparing to unpack .../17-libfreetype6_2.13.2+dfsg-ok1_amd64.deb ...
Unpacking libfreetype6:amd64 (2.13.2+dfsg-ok1) ...
Selecting previously unselected package ucf.
Preparing to unpack .../18-ucf_3.0043+nmu1-ok1_all.deb ...
Moving old data out of the way
Unpacking ucf (3.0043+nmu1-ok1) ...
Selecting previously unselected package fonts-dejavu-core.
Preparing to unpack .../19-fonts-dejavu-core_2.37-ok1_all.deb ...
Unpacking fonts-dejavu-core (2.37-ok1) ...
Selecting previously unselected package fontconfig-config.
Preparing to unpack .../20-fontconfig-config_2.15.0-ok5_all.deb ...
Unpacking fontconfig-config (2.15.0-ok5) ...
Selecting previously unselected package libfontconfig1:amd64.
Preparing to unpack .../21-libfontconfig1_2.15.0-ok5_amd64.deb ...
Unpacking libfontconfig1:amd64 (2.15.0-ok5) ...
Selecting previously unselected package fontconfig.
Preparing to unpack .../22-fontconfig_2.15.0-ok5_amd64.deb ...
Unpacking fontconfig (2.15.0-ok5) ...
Selecting previously unselected package libdrm-common.
Preparing to unpack .../23-libdrm-common_2.4.120-ok1_all.deb ...
Unpacking libdrm-common (2.4.120-ok1) ...
Selecting previously unselected package libdrm2:amd64.
Preparing to unpack .../24-libdrm2_2.4.120-ok1_amd64.deb ...
Unpacking libdrm2:amd64 (2.4.120-ok1) ...
Selecting previously unselected package libglvnd0:amd64.
Preparing to unpack .../25-libglvnd0_1.7.0-ok1_amd64.deb ...
Unpacking libglvnd0:amd64 (1.7.0-ok1) ...
Selecting previously unselected package libwayland-server0:amd64.
Preparing to unpack .../26-libwayland-server0_1.23.0-1ok3_amd64.deb ...
Unpacking libwayland-server0:amd64 (1.23.0-1ok3) ...
Selecting previously unselected package libxau6:amd64.
Preparing to unpack .../27-libxau6_1%3a1.0.9-ok1_amd64.deb ...
Unpacking libxau6:amd64 (1:1.0.9-ok1) ...
Selecting previously unselected package libxdmcp6:amd64.
Preparing to unpack .../28-libxdmcp6_1%3a1.1.3-ok1_amd64.deb ...
Unpacking libxdmcp6:amd64 (1:1.1.3-ok1) ...
Selecting previously unselected package libxcb1:amd64.
Preparing to unpack .../29-libxcb1_1.15-ok2_amd64.deb ...
Unpacking libxcb1:amd64 (1.15-ok2) ...
Selecting previously unselected package libxcb-randr0:amd64.
Preparing to unpack .../30-libxcb-randr0_1.15-ok2_amd64.deb ...
Unpacking libxcb-randr0:amd64 (1.15-ok2) ...
Selecting previously unselected package libgbm1:amd64.
Preparing to unpack .../31-libgbm1_24.0.5-ok1_amd64.deb ...
Unpacking libgbm1:amd64 (24.0.5-ok1) ...
Selecting previously unselected package libglapi-mesa:amd64.
Preparing to unpack .../32-libglapi-mesa_24.0.5-ok1_amd64.deb ...
Unpacking libglapi-mesa:amd64 (24.0.5-ok1) ...
Selecting previously unselected package libwayland-client0:amd64.
Preparing to unpack .../33-libwayland-client0_1.23.0-1ok3_amd64.deb ...
Unpacking libwayland-client0:amd64 (1.23.0-1ok3) ...
Selecting previously unselected package libx11-data.
Preparing to unpack .../34-libx11-data_2%3a1.8.7-ok1_all.deb ...
Unpacking libx11-data (2:1.8.7-ok1) ...
Selecting previously unselected package libx11-6:amd64.
Preparing to unpack .../35-libx11-6_2%3a1.8.7-ok1_amd64.deb ...
Unpacking libx11-6:amd64 (2:1.8.7-ok1) ...
Selecting previously unselected package libx11-xcb1:amd64.
Preparing to unpack .../36-libx11-xcb1_2%3a1.8.7-ok1_amd64.deb ...
Unpacking libx11-xcb1:amd64 (2:1.8.7-ok1) ...
Selecting previously unselected package libxcb-dri2-0:amd64.
Preparing to unpack .../37-libxcb-dri2-0_1.15-ok2_amd64.deb ...
Unpacking libxcb-dri2-0:amd64 (1.15-ok2) ...
Selecting previously unselected package libxcb-dri3-0:amd64.
Preparing to unpack .../38-libxcb-dri3-0_1.15-ok2_amd64.deb ...
Unpacking libxcb-dri3-0:amd64 (1.15-ok2) ...
Selecting previously unselected package libxcb-present0:amd64.
Preparing to unpack .../39-libxcb-present0_1.15-ok2_amd64.deb ...
Unpacking libxcb-present0:amd64 (1.15-ok2) ...
Selecting previously unselected package libxcb-sync1:amd64.
Preparing to unpack .../40-libxcb-sync1_1.15-ok2_amd64.deb ...
Unpacking libxcb-sync1:amd64 (1.15-ok2) ...
Selecting previously unselected package libxcb-xfixes0:amd64.
Preparing to unpack .../41-libxcb-xfixes0_1.15-ok2_amd64.deb ...
Unpacking libxcb-xfixes0:amd64 (1.15-ok2) ...
Selecting previously unselected package libxshmfence1:amd64.
Preparing to unpack .../42-libxshmfence1_1.3-ok1_amd64.deb ...
Unpacking libxshmfence1:amd64 (1.3-ok1) ...
Selecting previously unselected package libegl-mesa0:amd64.
Preparing to unpack .../43-libegl-mesa0_24.0.5-ok1_amd64.deb ...
Unpacking libegl-mesa0:amd64 (24.0.5-ok1) ...
Selecting previously unselected package libegl1:amd64.
Preparing to unpack .../44-libegl1_1.7.0-ok1_amd64.deb ...
Unpacking libegl1:amd64 (1.7.0-ok1) ...
Selecting previously unselected package libvulkan1:amd64.
Preparing to unpack .../45-libvulkan1_1.3.275.0-ok2_amd64.deb ...
Unpacking libvulkan1:amd64 (1.3.275.0-ok2) ...
Selecting previously unselected package libdrm-amdgpu1:amd64.
Preparing to unpack .../46-libdrm-amdgpu1_2.4.120-ok1_amd64.deb ...
Unpacking libdrm-amdgpu1:amd64 (2.4.120-ok1) ...
Selecting previously unselected package libpciaccess0:amd64.
Preparing to unpack .../47-libpciaccess0_0.17-ok1_amd64.deb ...
Unpacking libpciaccess0:amd64 (0.17-ok1) ...
Selecting previously unselected package libdrm-intel1:amd64.
Preparing to unpack .../48-libdrm-intel1_2.4.120-ok1_amd64.deb ...
Unpacking libdrm-intel1:amd64 (2.4.120-ok1) ...
Selecting previously unselected package libdrm-nouveau2:amd64.
Preparing to unpack .../49-libdrm-nouveau2_2.4.120-ok1_amd64.deb ...
Unpacking libdrm-nouveau2:amd64 (2.4.120-ok1) ...
Selecting previously unselected package libdrm-radeon1:amd64.
Preparing to unpack .../50-libdrm-radeon1_2.4.120-ok1_amd64.deb ...
Unpacking libdrm-radeon1:amd64 (2.4.120-ok1) ...
Selecting previously unselected package libelf1t64:amd64.
Preparing to unpack .../51-libelf1t64_0.190-ok3_amd64.deb ...
Unpacking libelf1t64:amd64 (0.190-ok3) ...
Selecting previously unselected package libedit2:amd64.
Preparing to unpack .../52-libedit2_3.1-20230828-ok1_amd64.deb ...
Unpacking libedit2:amd64 (3.1-20230828-ok1) ...
Selecting previously unselected package libllvm17t64:amd64.
Preparing to unpack .../53-libllvm17t64_1%3a17.0.6-9ok4_amd64.deb ...
Unpacking libllvm17t64:amd64 (1:17.0.6-9ok4) ...
Selecting previously unselected package libsensors-config.
Preparing to unpack .../54-libsensors-config_1%3a3.6.0-ok1_all.deb ...
Unpacking libsensors-config (1:3.6.0-ok1) ...
Selecting previously unselected package libsensors5:amd64.
Preparing to unpack .../55-libsensors5_1%3a3.6.0-ok1_amd64.deb ...
Unpacking libsensors5:amd64 (1:3.6.0-ok1) ...
Selecting previously unselected package libgl1-mesa-dri:amd64.
Preparing to unpack .../56-libgl1-mesa-dri_24.0.5-ok1_amd64.deb ...
Unpacking libgl1-mesa-dri:amd64 (24.0.5-ok1) ...
Selecting previously unselected package libxcb-glx0:amd64.
Preparing to unpack .../57-libxcb-glx0_1.15-ok2_amd64.deb ...
Unpacking libxcb-glx0:amd64 (1.15-ok2) ...
Selecting previously unselected package libxcb-shm0:amd64.
Preparing to unpack .../58-libxcb-shm0_1.15-ok2_amd64.deb ...
Unpacking libxcb-shm0:amd64 (1.15-ok2) ...
Selecting previously unselected package libxext6:amd64.
Preparing to unpack .../59-libxext6_2%3a1.3.4-ok2_amd64.deb ...
Unpacking libxext6:amd64 (2:1.3.4-ok2) ...
Selecting previously unselected package libxfixes3:amd64.
Preparing to unpack .../60-libxfixes3_1%3a6.0.0-ok1_amd64.deb ...
Unpacking libxfixes3:amd64 (1:6.0.0-ok1) ...
Selecting previously unselected package libxxf86vm1:amd64.
Preparing to unpack .../61-libxxf86vm1_1%3a1.1.4-ok1_amd64.deb ...
Unpacking libxxf86vm1:amd64 (1:1.1.4-ok1) ...
Selecting previously unselected package libglx-mesa0:amd64.
Preparing to unpack .../62-libglx-mesa0_24.0.5-ok1_amd64.deb ...
Unpacking libglx-mesa0:amd64 (24.0.5-ok1) ...
Selecting previously unselected package libglx0:amd64.
Preparing to unpack .../63-libglx0_1.7.0-ok1_amd64.deb ...
Unpacking libglx0:amd64 (1.7.0-ok1) ...
Selecting previously unselected package libgl1:amd64.
Preparing to unpack .../64-libgl1_1.7.0-ok1_amd64.deb ...
Unpacking libgl1:amd64 (1.7.0-ok1) ...
Selecting previously unselected package libgraphite2-3:amd64.
Preparing to unpack .../65-libgraphite2-3_1.3.14-ok1_amd64.deb ...
Unpacking libgraphite2-3:amd64 (1.3.14-ok1) ...
Selecting previously unselected package libharfbuzz0b:amd64.
Preparing to unpack .../66-libharfbuzz0b_8.3.0-ok2_amd64.deb ...
Unpacking libharfbuzz0b:amd64 (8.3.0-ok2) ...
Selecting previously unselected package x11-common.
Preparing to unpack .../67-x11-common_1%3a7.7+23-ok1_all.deb ...
Unpacking x11-common (1:7.7+23-ok1) ...
Selecting previously unselected package libice6:amd64.
Preparing to unpack .../68-libice6_2%3a1.0.10-ok1_amd64.deb ...
Unpacking libice6:amd64 (2:1.0.10-ok1) ...
Selecting previously unselected package libevdev2:amd64.
Preparing to unpack .../69-libevdev2_1.13.1+dfsg-ok1_amd64.deb ...
Unpacking libevdev2:amd64 (1.13.1+dfsg-ok1) ...
Selecting previously unselected package libmtdev1t64:amd64.
Preparing to unpack .../70-libmtdev1t64_1.1.6-ok1_amd64.deb ...
Unpacking libmtdev1t64:amd64 (1.1.6-ok1) ...
Selecting previously unselected package libgudev-1.0-0:amd64.
Preparing to unpack .../71-libgudev-1.0-0_1%3a238-ok2_amd64.deb ...
Unpacking libgudev-1.0-0:amd64 (1:238-ok2) ...
Selecting previously unselected package libwacom-common.
Preparing to unpack .../72-libwacom-common_1.3-ok3.2_all.deb ...
Unpacking libwacom-common (1.3-ok3.2) ...
Selecting previously unselected package libwacom2:amd64.
Preparing to unpack .../73-libwacom2_1.3-ok3.2_amd64.deb ...
Unpacking libwacom2:amd64 (1.3-ok3.2) ...
Selecting previously unselected package libinput-bin.
Preparing to unpack .../74-libinput-bin_1.25.0-ok1.2_amd64.deb ...
Unpacking libinput-bin (1.25.0-ok1.2) ...
Selecting previously unselected package libinput10:amd64.
Preparing to unpack .../75-libinput10_1.25.0-ok1.2_amd64.deb ...
Unpacking libinput10:amd64 (1.25.0-ok1.2) ...
Selecting previously unselected package libjpeg62-turbo:amd64.
Preparing to unpack .../76-libjpeg62-turbo_1%3a2.1.2-ok2_amd64.deb ...
Unpacking libjpeg62-turbo:amd64 (1:2.1.2-ok2) ...
Selecting previously unselected package libmd4c0:amd64.
Preparing to unpack .../77-libmd4c0_0.4.8-ok1_amd64.deb ...
Unpacking libmd4c0:amd64 (0.4.8-ok1) ...
Selecting previously unselected package libqt5dbus5:amd64.
Preparing to unpack .../78-libqt5dbus5_5.15.10+dfsg-3ok2.13_amd64.deb ...
Unpacking libqt5dbus5:amd64 (5.15.10+dfsg-3ok2.13) ...
Selecting previously unselected package libqt5network5:amd64.
Preparing to unpack .../79-libqt5network5_5.15.10+dfsg-3ok2.13_amd64.deb ...
Unpacking libqt5network5:amd64 (5.15.10+dfsg-3ok2.13) ...
Selecting previously unselected package libsm6:amd64.
Preparing to unpack .../80-libsm6_2%3a1.2.3-ok1_amd64.deb ...
Unpacking libsm6:amd64 (2:1.2.3-ok1) ...
Selecting previously unselected package libxcb-icccm4:amd64.
Preparing to unpack .../81-libxcb-icccm4_0.4.1-ok1_amd64.deb ...
Unpacking libxcb-icccm4:amd64 (0.4.1-ok1) ...
Selecting previously unselected package libxcb-util1:amd64.
Preparing to unpack .../82-libxcb-util1_0.4.0-ok2_amd64.deb ...
Unpacking libxcb-util1:amd64 (0.4.0-ok2) ...
Selecting previously unselected package libxcb-image0:amd64.
Preparing to unpack .../83-libxcb-image0_0.4.0-ok1_amd64.deb ...
Unpacking libxcb-image0:amd64 (0.4.0-ok1) ...
Selecting previously unselected package libxcb-keysyms1:amd64.
Preparing to unpack .../84-libxcb-keysyms1_0.4.0-ok1_amd64.deb ...
Unpacking libxcb-keysyms1:amd64 (0.4.0-ok1) ...
Selecting previously unselected package libxcb-render0:amd64.
Preparing to unpack .../85-libxcb-render0_1.15-ok2_amd64.deb ...
Unpacking libxcb-render0:amd64 (1.15-ok2) ...
Selecting previously unselected package libxcb-render-util0:amd64.
Preparing to unpack .../86-libxcb-render-util0_0.3.9-ok1_amd64.deb ...
Unpacking libxcb-render-util0:amd64 (0.3.9-ok1) ...
Selecting previously unselected package libxcb-shape0:amd64.
Preparing to unpack .../87-libxcb-shape0_1.15-ok2_amd64.deb ...
Unpacking libxcb-shape0:amd64 (1.15-ok2) ...
Selecting previously unselected package libxcb-xinerama0:amd64.
Preparing to unpack .../88-libxcb-xinerama0_1.15-ok2_amd64.deb ...
Unpacking libxcb-xinerama0:amd64 (1.15-ok2) ...
Selecting previously unselected package libxcb-xinput0:amd64.
Preparing to unpack .../89-libxcb-xinput0_1.15-ok2_amd64.deb ...
Unpacking libxcb-xinput0:amd64 (1.15-ok2) ...
Selecting previously unselected package libxcb-xkb1:amd64.
Preparing to unpack .../90-libxcb-xkb1_1.15-ok2_amd64.deb ...
Unpacking libxcb-xkb1:amd64 (1.15-ok2) ...
Selecting previously unselected package xkb-data.
Preparing to unpack .../91-xkb-data_2.41-ok1_all.deb ...
Unpacking xkb-data (2.41-ok1) ...
Selecting previously unselected package libxkbcommon0:amd64.
Preparing to unpack .../92-libxkbcommon0_1.5.0-ok1_amd64.deb ...
Unpacking libxkbcommon0:amd64 (1.5.0-ok1) ...
Selecting previously unselected package libxkbcommon-x11-0:amd64.
Preparing to unpack .../93-libxkbcommon-x11-0_1.5.0-ok1_amd64.deb ...
Unpacking libxkbcommon-x11-0:amd64 (1.5.0-ok1) ...
Selecting previously unselected package libxrender1:amd64.
Preparing to unpack .../94-libxrender1_1%3a0.9.10-ok1_amd64.deb ...
Unpacking libxrender1:amd64 (1:0.9.10-ok1) ...
Selecting previously unselected package libqt5gui5:amd64.
Preparing to unpack .../95-libqt5gui5_5.15.10+dfsg-3ok2.13_amd64.deb ...
Unpacking libqt5gui5:amd64 (5.15.10+dfsg-3ok2.13) ...
Selecting previously unselected package libqt5widgets5:amd64.
Preparing to unpack .../96-libqt5widgets5_5.15.10+dfsg-3ok2.13_amd64.deb ...
Unpacking libqt5widgets5:amd64 (5.15.10+dfsg-3ok2.13) ...
Selecting previously unselected package libqt5scripttools5:amd64.
Preparing to unpack .../97-libqt5scripttools5_5.15.10+dfsg-2ok1.3_amd64.deb ...
Unpacking libqt5scripttools5:amd64 (5.15.10+dfsg-2ok1.3) ...
Selecting previously unselected package libpython3.12-minimal:amd64.
Preparing to unpack .../98-libpython3.12-minimal_3.12.2-ok4.1_amd64.deb ...
Unpacking libpython3.12-minimal:amd64 (3.12.2-ok4.1) ...
Selecting previously unselected package python3.12-minimal.
Preparing to unpack .../99-python3.12-minimal_3.12.2-ok4.1_amd64.deb ...
Unpacking python3.12-minimal (3.12.2-ok4.1) ...
Setting up libpython3.12-minimal:amd64 (3.12.2-ok4.1) ...
Setting up libexpat1:amd64 (2.6.0-ok1) ...
Setting up python3.12-minimal (3.12.2-ok4.1) ...
Selecting previously unselected package python3-minimal.
(Reading database ... 16030 files and directories currently installed.)
Preparing to unpack .../0-python3-minimal_3.12.2-ok1_amd64.deb ...
Unpacking python3-minimal (3.12.2-ok1) ...
Selecting previously unselected package media-types.
Preparing to unpack .../1-media-types_10.1.0-ok1_all.deb ...
Unpacking media-types (10.1.0-ok1) ...
Selecting previously unselected package netbase.
Preparing to unpack .../2-netbase_6.4-ok1_all.deb ...
Unpacking netbase (6.4-ok1) ...
Selecting previously unselected package libpython3.12-stdlib:amd64.
Preparing to unpack .../3-libpython3.12-stdlib_3.12.2-ok4.1_amd64.deb ...
Unpacking libpython3.12-stdlib:amd64 (3.12.2-ok4.1) ...
Selecting previously unselected package python3.12.
Preparing to unpack .../4-python3.12_3.12.2-ok4.1_amd64.deb ...
Unpacking python3.12 (3.12.2-ok4.1) ...
Selecting previously unselected package libpython3-stdlib:amd64.
Preparing to unpack .../5-libpython3-stdlib_3.12.2-ok1_amd64.deb ...
Unpacking libpython3-stdlib:amd64 (3.12.2-ok1) ...
Setting up python3-minimal (3.12.2-ok1) ...
Selecting previously unselected package python3.
(Reading database ... 16472 files and directories currently installed.)
Preparing to unpack .../000-python3_3.12.2-ok1_amd64.deb ...
Unpacking python3 (3.12.2-ok1) ...
Selecting previously unselected package xorg-sgml-doctools.
Preparing to unpack .../001-xorg-sgml-doctools_1%3a1.11-ok1_all.deb ...
Unpacking xorg-sgml-doctools (1:1.11-ok1) ...
Selecting previously unselected package x11proto-dev.
Preparing to unpack .../002-x11proto-dev_2024.1-1ok3_all.deb ...
Unpacking x11proto-dev (2024.1-1ok3) ...
Selecting previously unselected package x11proto-core-dev.
Preparing to unpack .../003-x11proto-core-dev_2024.1-1ok3_all.deb ...
Unpacking x11proto-core-dev (2024.1-1ok3) ...
Selecting previously unselected package libxau-dev:amd64.
Preparing to unpack .../004-libxau-dev_1%3a1.0.9-ok1_amd64.deb ...
Unpacking libxau-dev:amd64 (1:1.0.9-ok1) ...
Selecting previously unselected package libxdmcp-dev:amd64.
Preparing to unpack .../005-libxdmcp-dev_1%3a1.1.3-ok1_amd64.deb ...
Unpacking libxdmcp-dev:amd64 (1:1.1.3-ok1) ...
Selecting previously unselected package xtrans-dev.
Preparing to unpack .../006-xtrans-dev_1.4.0-ok1_all.deb ...
Unpacking xtrans-dev (1.4.0-ok1) ...
Selecting previously unselected package libpthread-stubs0-dev:amd64.
Preparing to unpack .../007-libpthread-stubs0-dev_0.4-ok2_amd64.deb ...
Unpacking libpthread-stubs0-dev:amd64 (0.4-ok2) ...
Selecting previously unselected package libxcb1-dev:amd64.
Preparing to unpack .../008-libxcb1-dev_1.15-ok2_amd64.deb ...
Unpacking libxcb1-dev:amd64 (1.15-ok2) ...
Selecting previously unselected package libx11-dev:amd64.
Preparing to unpack .../009-libx11-dev_2%3a1.8.7-ok1_amd64.deb ...
Unpacking libx11-dev:amd64 (2:1.8.7-ok1) ...
Selecting previously unselected package libglx-dev:amd64.
Preparing to unpack .../010-libglx-dev_1.7.0-ok1_amd64.deb ...
Unpacking libglx-dev:amd64 (1.7.0-ok1) ...
Selecting previously unselected package libgl-dev:amd64.
Preparing to unpack .../011-libgl-dev_1.7.0-ok1_amd64.deb ...
Unpacking libgl-dev:amd64 (1.7.0-ok1) ...
Selecting previously unselected package libegl-dev:amd64.
Preparing to unpack .../012-libegl-dev_1.7.0-ok1_amd64.deb ...
Unpacking libegl-dev:amd64 (1.7.0-ok1) ...
Selecting previously unselected package libopengl0:amd64.
Preparing to unpack .../013-libopengl0_1.7.0-ok1_amd64.deb ...
Unpacking libopengl0:amd64 (1.7.0-ok1) ...
Selecting previously unselected package libglu1-mesa:amd64.
Preparing to unpack .../014-libglu1-mesa_9.0.2-ok1_amd64.deb ...
Unpacking libglu1-mesa:amd64 (9.0.2-ok1) ...
Selecting previously unselected package libopengl-dev:amd64.
Preparing to unpack .../015-libopengl-dev_1.7.0-ok1_amd64.deb ...
Unpacking libopengl-dev:amd64 (1.7.0-ok1) ...
Selecting previously unselected package libglu1-mesa-dev:amd64.
Preparing to unpack .../016-libglu1-mesa-dev_9.0.2-ok1_amd64.deb ...
Unpacking libglu1-mesa-dev:amd64 (9.0.2-ok1) ...
Selecting previously unselected package libqt5concurrent5:amd64.
Preparing to unpack .../017-libqt5concurrent5_5.15.10+dfsg-3ok2.13_amd64.deb ...
Unpacking libqt5concurrent5:amd64 (5.15.10+dfsg-3ok2.13) ...
Selecting previously unselected package libavahi-common-data:amd64.
Preparing to unpack .../018-libavahi-common-data_0.8-ok1_amd64.deb ...
Unpacking libavahi-common-data:amd64 (0.8-ok1) ...
Selecting previously unselected package libavahi-common3:amd64.
Preparing to unpack .../019-libavahi-common3_0.8-ok1_amd64.deb ...
Unpacking libavahi-common3:amd64 (0.8-ok1) ...
Selecting previously unselected package libavahi-client3:amd64.
Preparing to unpack .../020-libavahi-client3_0.8-ok1_amd64.deb ...
Unpacking libavahi-client3:amd64 (0.8-ok1) ...
Selecting previously unselected package libcups2t64:amd64.
Preparing to unpack .../021-libcups2t64_2.4.7-ok2_amd64.deb ...
Unpacking libcups2t64:amd64 (2.4.7-ok2) ...
Selecting previously unselected package libqt5printsupport5:amd64.
Preparing to unpack .../022-libqt5printsupport5_5.15.10+dfsg-3ok2.13_amd64.deb ...
Unpacking libqt5printsupport5:amd64 (5.15.10+dfsg-3ok2.13) ...
Selecting previously unselected package libqt5sql5:amd64.
Preparing to unpack .../023-libqt5sql5_5.15.10+dfsg-3ok2.13_amd64.deb ...
Unpacking libqt5sql5:amd64 (5.15.10+dfsg-3ok2.13) ...
Selecting previously unselected package libqt5test5:amd64.
Preparing to unpack .../024-libqt5test5_5.15.10+dfsg-3ok2.13_amd64.deb ...
Unpacking libqt5test5:amd64 (5.15.10+dfsg-3ok2.13) ...
Selecting previously unselected package libqt5xml5:amd64.
Preparing to unpack .../025-libqt5xml5_5.15.10+dfsg-3ok2.13_amd64.deb ...
Unpacking libqt5xml5:amd64 (5.15.10+dfsg-3ok2.13) ...
Selecting previously unselected package libvulkan-dev:amd64.
Preparing to unpack .../026-libvulkan-dev_1.3.275.0-ok2_amd64.deb ...
Unpacking libvulkan-dev:amd64 (1.3.275.0-ok2) ...
Selecting previously unselected package libxext-dev:amd64.
Preparing to unpack .../027-libxext-dev_2%3a1.3.4-ok2_amd64.deb ...
Unpacking libxext-dev:amd64 (2:1.3.4-ok2) ...
Selecting previously unselected package qt5-qmake-bin.
Preparing to unpack .../028-qt5-qmake-bin_5.15.10+dfsg-3ok2.13_amd64.deb ...
Unpacking qt5-qmake-bin (5.15.10+dfsg-3ok2.13) ...
Selecting previously unselected package qtchooser.
Preparing to unpack .../029-qtchooser_66-ok2_amd64.deb ...
Unpacking qtchooser (66-ok2) ...
Selecting previously unselected package qt5-qmake:amd64.
Preparing to unpack .../030-qt5-qmake_5.15.10+dfsg-3ok2.13_amd64.deb ...
Unpacking qt5-qmake:amd64 (5.15.10+dfsg-3ok2.13) ...
Selecting previously unselected package qtbase5-dev-tools.
Preparing to unpack .../031-qtbase5-dev-tools_5.15.10+dfsg-3ok2.13_amd64.deb ...
Unpacking qtbase5-dev-tools (5.15.10+dfsg-3ok2.13) ...
Selecting previously unselected package qtbase5-dev:amd64.
Preparing to unpack .../032-qtbase5-dev_5.15.10+dfsg-3ok2.13_amd64.deb ...
Unpacking qtbase5-dev:amd64 (5.15.10+dfsg-3ok2.13) ...
Selecting previously unselected package qtscript5-dev:amd64.
Preparing to unpack .../033-qtscript5-dev_5.15.10+dfsg-2ok1.3_amd64.deb ...
Unpacking qtscript5-dev:amd64 (5.15.10+dfsg-2ok1.3) ...
Selecting previously unselected package libuchardet0:amd64.
Preparing to unpack .../034-libuchardet0_0.0.8-ok1_amd64.deb ...
Unpacking libuchardet0:amd64 (0.0.8-ok1) ...
Selecting previously unselected package groff-base.
Preparing to unpack .../035-groff-base_1.23.0-3ok1_amd64.deb ...
Unpacking groff-base (1.23.0-3ok1) ...
Selecting previously unselected package libpopt0:amd64.
Preparing to unpack .../036-libpopt0_1.19+dfsg-1ok1.0_amd64.deb ...
Unpacking libpopt0:amd64 (1.19+dfsg-1ok1.0) ...
Selecting previously unselected package logrotate.
Preparing to unpack .../037-logrotate_3.21.0-ok1_amd64.deb ...
Unpacking logrotate (3.21.0-ok1) ...
Selecting previously unselected package bsdextrautils.
Preparing to unpack .../038-bsdextrautils_2.39.3-ok2build5_amd64.deb ...
Unpacking bsdextrautils (2.39.3-ok2build5) ...
Selecting previously unselected package libpipeline1:amd64.
Preparing to unpack .../039-libpipeline1_1.5.7-ok1_amd64.deb ...
Unpacking libpipeline1:amd64 (1.5.7-ok1) ...
Selecting previously unselected package man-db.
Preparing to unpack .../040-man-db_2.12.0-ok1_amd64.deb ...
Unpacking man-db (2.12.0-ok1) ...
Selecting previously unselected package libmagic-mgc.
Preparing to unpack .../041-libmagic-mgc_1%3a5.45-ok1_amd64.deb ...
Unpacking libmagic-mgc (1:5.45-ok1) ...
Selecting previously unselected package libmagic1t64:amd64.
Preparing to unpack .../042-libmagic1t64_1%3a5.45-ok1_amd64.deb ...
Unpacking libmagic1t64:amd64 (1:5.45-ok1) ...
Selecting previously unselected package file.
Preparing to unpack .../043-file_1%3a5.45-ok1_amd64.deb ...
Unpacking file (1:5.45-ok1) ...
Selecting previously unselected package gettext-base.
Preparing to unpack .../044-gettext-base_0.22-ok3_amd64.deb ...
Unpacking gettext-base (0.22-ok3) ...
Selecting previously unselected package m4.
Preparing to unpack .../045-m4_1.4.19-ok1_amd64.deb ...
Unpacking m4 (1.4.19-ok1) ...
Selecting previously unselected package autoconf.
Preparing to unpack .../046-autoconf_2.71-ok3_all.deb ...
Unpacking autoconf (2.71-ok3) ...
Selecting previously unselected package autotools-dev.
Preparing to unpack .../047-autotools-dev_20220506-ok1_all.deb ...
Unpacking autotools-dev (20220506-ok1) ...
Selecting previously unselected package automake.
Preparing to unpack .../048-automake_1%3a1.16.5-ok1_all.deb ...
Unpacking automake (1:1.16.5-ok1) ...
Selecting previously unselected package autopoint.
Preparing to unpack .../049-autopoint_0.22-ok3_all.deb ...
Unpacking autopoint (0.22-ok3) ...
Selecting previously unselected package libdebhelper-perl.
Preparing to unpack .../050-libdebhelper-perl_13.15.3-ok1_all.deb ...
Unpacking libdebhelper-perl (13.15.3-ok1) ...
Selecting previously unselected package libtool.
Preparing to unpack .../051-libtool_2.4.7-ok2_all.deb ...
Unpacking libtool (2.4.7-ok2) ...
Selecting previously unselected package dh-autoreconf.
Preparing to unpack .../052-dh-autoreconf_20-ok1_all.deb ...
Unpacking dh-autoreconf (20-ok1) ...
Selecting previously unselected package libarchive-zip-perl.
Preparing to unpack .../053-libarchive-zip-perl_1.68-ok1_all.deb ...
Unpacking libarchive-zip-perl (1.68-ok1) ...
Selecting previously unselected package libsub-override-perl.
Preparing to unpack .../054-libsub-override-perl_0.10-ok1_all.deb ...
Unpacking libsub-override-perl (0.10-ok1) ...
Selecting previously unselected package libfile-stripnondeterminism-perl.
Preparing to unpack .../055-libfile-stripnondeterminism-perl_1.13.1-ok1_all.deb ...
Unpacking libfile-stripnondeterminism-perl (1.13.1-ok1) ...
Selecting previously unselected package dh-strip-nondeterminism.
Preparing to unpack .../056-dh-strip-nondeterminism_1.13.1-ok1_all.deb ...
Unpacking dh-strip-nondeterminism (1.13.1-ok1) ...
Selecting previously unselected package dwz.
Preparing to unpack .../057-dwz_0.15-1ok1_amd64.deb ...
Unpacking dwz (0.15-1ok1) ...
Selecting previously unselected package gettext.
Preparing to unpack .../058-gettext_0.22-ok3_amd64.deb ...
Unpacking gettext (0.22-ok3) ...
Selecting previously unselected package intltool-debian.
Preparing to unpack .../059-intltool-debian_0.35.0+20060710.5-ok2_all.deb ...
Unpacking intltool-debian (0.35.0+20060710.5-ok2) ...
Selecting previously unselected package po-debconf.
Preparing to unpack .../060-po-debconf_1.0.21+nmu1-ok1_all.deb ...
Unpacking po-debconf (1.0.21+nmu1-ok1) ...
Selecting previously unselected package debhelper.
Preparing to unpack .../061-debhelper_13.15.3-ok1_all.deb ...
Unpacking debhelper (13.15.3-ok1) ...
Selecting previously unselected package gir1.2-glib-2.0:amd64.
Preparing to unpack .../062-gir1.2-glib-2.0_2.80.0-ok1.2~1128_amd64.deb ...
Unpacking gir1.2-glib-2.0:amd64 (2.80.0-ok1.2~1128) ...
Selecting previously unselected package gir1.2-gudev-1.0:amd64.
Preparing to unpack .../063-gir1.2-gudev-1.0_1%3a238-ok2_amd64.deb ...
Unpacking gir1.2-gudev-1.0:amd64 (1:238-ok2) ...
Selecting previously unselected package kwayland-data.
Preparing to unpack .../064-kwayland-data_4%3a5.92.0-ok4.3_all.deb ...
Unpacking kwayland-data (4:5.92.0-ok4.3) ...
Selecting previously unselected package uuid-dev:amd64.
Preparing to unpack .../065-uuid-dev_2.39.3-ok2build5_amd64.deb ...
Unpacking uuid-dev:amd64 (2.39.3-ok2build5) ...
Selecting previously unselected package libblkid-dev:amd64.
Preparing to unpack .../066-libblkid-dev_2.39.3-ok2build5_amd64.deb ...
Unpacking libblkid-dev:amd64 (2.39.3-ok2build5) ...
Selecting previously unselected package libbrotli-dev:amd64.
Preparing to unpack .../067-libbrotli-dev_1.1.0-ok1_amd64.deb ...
Unpacking libbrotli-dev:amd64 (1.1.0-ok1) ...
Selecting previously unselected package libbz2-dev:amd64.
Preparing to unpack .../068-libbz2-dev_1.0.8.2-0k0_amd64.deb ...
Unpacking libbz2-dev:amd64 (1.0.8.2-0k0) ...
Selecting previously unselected package libz3-4:amd64.
Preparing to unpack .../069-libz3-4_4.8.12-ok1_amd64.deb ...
Unpacking libz3-4:amd64 (4.8.12-ok1) ...
Selecting previously unselected package libllvm15:amd64.
Preparing to unpack .../070-libllvm15_1%3a15.0.7-ok3_amd64.deb ...
Unpacking libllvm15:amd64 (1:15.0.7-ok3) ...
Selecting previously unselected package libclang1-15.
Preparing to unpack .../071-libclang1-15_1%3a15.0.7-ok3_amd64.deb ...
Unpacking libclang1-15 (1:15.0.7-ok3) ...
Selecting previously unselected package libdbus-glib-1-2:amd64.
Preparing to unpack .../072-libdbus-glib-1-2_0.112-ok1_amd64.deb ...
Unpacking libdbus-glib-1-2:amd64 (0.112-ok1) ...
Selecting previously unselected package libevdev-dev:amd64.
Preparing to unpack .../073-libevdev-dev_1.13.1+dfsg-ok1_amd64.deb ...
Unpacking libevdev-dev:amd64 (1.13.1+dfsg-ok1) ...
Selecting previously unselected package libexpat1-dev:amd64.
Preparing to unpack .../074-libexpat1-dev_2.6.0-ok1_amd64.deb ...
Unpacking libexpat1-dev:amd64 (2.6.0-ok1) ...
Selecting previously unselected package libffi-dev:amd64.
Preparing to unpack .../075-libffi-dev_3.4.6-ok2_amd64.deb ...
Unpacking libffi-dev:amd64 (3.4.6-ok2) ...
Selecting previously unselected package zlib1g-dev:amd64.
Preparing to unpack .../076-zlib1g-dev_1%3a1.3.dfsg-ok3_amd64.deb ...
Unpacking zlib1g-dev:amd64 (1:1.3.dfsg-ok3) ...
Selecting previously unselected package libpng-dev:amd64.
Preparing to unpack .../077-libpng-dev_1.6.43-ok1_amd64.deb ...
Unpacking libpng-dev:amd64 (1.6.43-ok1) ...
Selecting previously unselected package libfreetype-dev:amd64.
Preparing to unpack .../078-libfreetype-dev_2.13.2+dfsg-ok1_amd64.deb ...
Unpacking libfreetype-dev:amd64 (2.13.2+dfsg-ok1) ...
Selecting previously unselected package libpkgconf4:amd64.
Preparing to unpack .../079-libpkgconf4_1.9.5-ok1_amd64.deb ...
Unpacking libpkgconf4:amd64 (1.9.5-ok1) ...
Selecting previously unselected package pkgconf-bin.
Preparing to unpack .../080-pkgconf-bin_1.9.5-ok1_amd64.deb ...
Unpacking pkgconf-bin (1.9.5-ok1) ...
Selecting previously unselected package pkgconf:amd64.
Preparing to unpack .../081-pkgconf_1.9.5-ok1_amd64.deb ...
Unpacking pkgconf:amd64 (1.9.5-ok1) ...
Selecting previously unselected package libfontconfig-dev:amd64.
Preparing to unpack .../082-libfontconfig-dev_2.15.0-ok5_amd64.deb ...
Unpacking libfontconfig-dev:amd64 (2.15.0-ok5) ...
Selecting previously unselected package libgirepository-2.0-0:amd64.
Preparing to unpack .../083-libgirepository-2.0-0_2.80.0-ok1.2~1128_amd64.deb ...
Unpacking libgirepository-2.0-0:amd64 (2.80.0-ok1.2~1128) ...
Selecting previously unselected package libglib2.0-data.
Preparing to unpack .../084-libglib2.0-data_2.80.0-ok1.2~1128_all.deb ...
Unpacking libglib2.0-data (2.80.0-ok1.2~1128) ...
Selecting previously unselected package libglib2.0-bin.
Preparing to unpack .../085-libglib2.0-bin_2.80.0-ok1.2~1128_amd64.deb ...
Unpacking libglib2.0-bin (2.80.0-ok1.2~1128) ...
Selecting previously unselected package python3-packaging.
Preparing to unpack .../086-python3-packaging_24.0-ok1_all.deb ...
Unpacking python3-packaging (24.0-ok1) ...
Selecting previously unselected package libglib2.0-dev-bin.
Preparing to unpack .../087-libglib2.0-dev-bin_2.80.0-ok1.2~1128_amd64.deb ...
Unpacking libglib2.0-dev-bin (2.80.0-ok1.2~1128) ...
Selecting previously unselected package libsepol-dev:amd64.
Preparing to unpack .../088-libsepol-dev_3.5-ok1_amd64.deb ...
Unpacking libsepol-dev:amd64 (3.5-ok1) ...
Selecting previously unselected package libpcre2-32-0:amd64.
Preparing to unpack .../089-libpcre2-32-0_10.42-4ok2_amd64.deb ...
Unpacking libpcre2-32-0:amd64 (10.42-4ok2) ...
Selecting previously unselected package libpcre2-posix3:amd64.
Preparing to unpack .../090-libpcre2-posix3_10.42-4ok2_amd64.deb ...
Unpacking libpcre2-posix3:amd64 (10.42-4ok2) ...
Selecting previously unselected package libpcre2-dev:amd64.
Preparing to unpack .../091-libpcre2-dev_10.42-4ok2_amd64.deb ...
Unpacking libpcre2-dev:amd64 (10.42-4ok2) ...
Selecting previously unselected package libselinux1-dev:amd64.
Preparing to unpack .../092-libselinux1-dev_3.5-ok2_amd64.deb ...
Unpacking libselinux1-dev:amd64 (3.5-ok2) ...
Selecting previously unselected package libmount-dev:amd64.
Preparing to unpack .../093-libmount-dev_2.39.3-ok2build5_amd64.deb ...
Unpacking libmount-dev:amd64 (2.39.3-ok2build5) ...
Selecting previously unselected package libglib2.0-dev:amd64.
Preparing to unpack .../094-libglib2.0-dev_2.80.0-ok1.2~1128_amd64.deb ...
Unpacking libglib2.0-dev:amd64 (2.80.0-ok1.2~1128) ...
Selecting previously unselected package libgsettings-qt1:amd64.
Preparing to unpack .../095-libgsettings-qt1_0.2-ok1_amd64.deb ...
Unpacking libgsettings-qt1:amd64 (0.2-ok1) ...
Selecting previously unselected package libgsettings-qt-dev:amd64.
Preparing to unpack .../096-libgsettings-qt-dev_0.2-ok1_amd64.deb ...
Unpacking libgsettings-qt-dev:amd64 (0.2-ok1) ...
Selecting previously unselected package libudev-dev:amd64.
Preparing to unpack .../097-libudev-dev_255.2-ok1.12_amd64.deb ...
Unpacking libudev-dev:amd64 (255.2-ok1.12) ...
Selecting previously unselected package libgudev-1.0-dev:amd64.
Preparing to unpack .../098-libgudev-1.0-dev_1%3a238-ok2_amd64.deb ...
Unpacking libgudev-1.0-dev:amd64 (1:238-ok2) ...
Selecting previously unselected package libmtdev-dev:amd64.
Preparing to unpack .../099-libmtdev-dev_1.1.6-ok1_amd64.deb ...
Unpacking libmtdev-dev:amd64 (1.1.6-ok1) ...
Selecting previously unselected package libwacom-dev:amd64.
Preparing to unpack .../100-libwacom-dev_1.3-ok3.2_amd64.deb ...
Unpacking libwacom-dev:amd64 (1.3-ok3.2) ...
Selecting previously unselected package libinput-dev:amd64.
Preparing to unpack .../101-libinput-dev_1.25.0-ok1.2_amd64.deb ...
Unpacking libinput-dev:amd64 (1.25.0-ok1.2) ...
Selecting previously unselected package libkf5waylandclient5:amd64.
Preparing to unpack .../102-libkf5waylandclient5_4%3a5.92.0-ok4.3_amd64.deb ...
Unpacking libkf5waylandclient5:amd64 (4:5.92.0-ok4.3) ...
Selecting previously unselected package libkf5windowsystem-data.
Preparing to unpack .../103-libkf5windowsystem-data_5.92.0-ok5.3_all.deb ...
Unpacking libkf5windowsystem-data (5.92.0-ok5.3) ...
Selecting previously unselected package libqt5x11extras5:amd64.
Preparing to unpack .../104-libqt5x11extras5_5.15.10-2ok1_amd64.deb ...
Unpacking libqt5x11extras5:amd64 (5.15.10-2ok1) ...
Selecting previously unselected package libxcb-res0:amd64.
Preparing to unpack .../105-libxcb-res0_1.15-ok2_amd64.deb ...
Unpacking libxcb-res0:amd64 (1.15-ok2) ...
Selecting previously unselected package libkf5windowsystem5:amd64.
Preparing to unpack .../106-libkf5windowsystem5_5.92.0-ok5.3_amd64.deb ...
Unpacking libkf5windowsystem5:amd64 (5.92.0-ok5.3) ...
Selecting previously unselected package libkf5windowsystem-dev.
Preparing to unpack .../107-libkf5windowsystem-dev_5.92.0-ok5.3_amd64.deb ...
Unpacking libkf5windowsystem-dev (5.92.0-ok5.3) ...
Selecting previously unselected package libkysdk-basecommon:amd64.
Preparing to unpack .../108-libkysdk-basecommon_2.5.1.0-0k0.6_amd64.deb ...
Unpacking libkysdk-basecommon:amd64 (2.5.1.0-0k0.6) ...
Selecting previously unselected package libkysdk-utils:amd64.
Preparing to unpack .../109-libkysdk-utils_2.5.1.0-0k0.6_amd64.deb ...
Unpacking libkysdk-utils:amd64 (2.5.1.0-0k0.6) ...
Selecting previously unselected package libkysdk-config:amd64.
Preparing to unpack .../110-libkysdk-config_2.5.1.0-0k0.6_amd64.deb ...
Unpacking libkysdk-config:amd64 (2.5.1.0-0k0.6) ...
Selecting previously unselected package libkysdk-utils-dev.
Preparing to unpack .../111-libkysdk-utils-dev_2.5.1.0-0k0.6_all.deb ...
Unpacking libkysdk-utils-dev (2.5.1.0-0k0.6) ...
Selecting previously unselected package libkysdk-config-dev.
Preparing to unpack .../112-libkysdk-config-dev_2.5.1.0-0k0.6_all.deb ...
Unpacking libkysdk-config-dev (2.5.1.0-0k0.6) ...
Selecting previously unselected package libkysdk-log:amd64.
Preparing to unpack .../113-libkysdk-log_2.5.1.0-0k0.6_amd64.deb ...
Unpacking libkysdk-log:amd64 (2.5.1.0-0k0.6) ...
Selecting previously unselected package libkysdk-waylandhelper.
Preparing to unpack .../114-libkysdk-waylandhelper_2.5.1.0-0k9.1_amd64.deb ...
Unpacking libkysdk-waylandhelper (2.5.1.0-0k9.1) ...
Selecting previously unselected package libqt5svg5:amd64.
Preparing to unpack .../115-libqt5svg5_5.15.10-2ok1_amd64.deb ...
Unpacking libqt5svg5:amd64 (5.15.10-2ok1) ...
Selecting previously unselected package libkysdk-qtwidgets.
Preparing to unpack .../116-libkysdk-qtwidgets_2.5.1.0-0k9.1_amd64.deb ...
Unpacking libkysdk-qtwidgets (2.5.1.0-0k9.1) ...
Selecting previously unselected package libkysdk-qtwidgets-dev.
Preparing to unpack .../117-libkysdk-qtwidgets-dev_2.5.1.0-0k9.1_amd64.deb ...
Unpacking libkysdk-qtwidgets-dev (2.5.1.0-0k9.1) ...
Selecting previously unselected package libkysdk-timer:amd64.
Preparing to unpack .../118-libkysdk-timer_2.5.1.0-0k0.6_amd64.deb ...
Unpacking libkysdk-timer:amd64 (2.5.1.0-0k0.6) ...
Selecting previously unselected package libkysdk-systime:amd64.
Preparing to unpack .../119-libkysdk-systime_2.5.1.2-0k1.8_amd64.deb ...
Unpacking libkysdk-systime:amd64 (2.5.1.2-0k1.8) ...
Selecting previously unselected package libkysdk-timer-dev.
Preparing to unpack .../120-libkysdk-timer-dev_2.5.1.0-0k0.6_all.deb ...
Unpacking libkysdk-timer-dev (2.5.1.0-0k0.6) ...
Selecting previously unselected package libkysdk-systime-dev.
Preparing to unpack .../121-libkysdk-systime-dev_2.5.1.2-0k1.8_all.deb ...
Unpacking libkysdk-systime-dev (2.5.1.2-0k1.8) ...
Selecting previously unselected package libkysdk-waylandhelper-dev.
Preparing to unpack .../122-libkysdk-waylandhelper-dev_2.5.1.0-0k9.1_amd64.deb ...
Unpacking libkysdk-waylandhelper-dev (2.5.1.0-0k9.1) ...
Selecting previously unselected package libqt5designer5:amd64.
Preparing to unpack .../123-libqt5designer5_5.15.10-5ok1.5_amd64.deb ...
Unpacking libqt5designer5:amd64 (5.15.10-5ok1.5) ...
Selecting previously unselected package libqt5designercomponents5:amd64.
Preparing to unpack .../124-libqt5designercomponents5_5.15.10-5ok1.5_amd64.deb ...
Unpacking libqt5designercomponents5:amd64 (5.15.10-5ok1.5) ...
Selecting previously unselected package libqt5help5:amd64.
Preparing to unpack .../125-libqt5help5_5.15.10-5ok1.5_amd64.deb ...
Unpacking libqt5help5:amd64 (5.15.10-5ok1.5) ...
Selecting previously unselected package libqt5qml5:amd64.
Preparing to unpack .../126-libqt5qml5_5.15.10+dfsg-2ok1.5_amd64.deb ...
Unpacking libqt5qml5:amd64 (5.15.10+dfsg-2ok1.5) ...
Selecting previously unselected package libqt5qmlmodels5:amd64.
Preparing to unpack .../127-libqt5qmlmodels5_5.15.10+dfsg-2ok1.5_amd64.deb ...
Unpacking libqt5qmlmodels5:amd64 (5.15.10+dfsg-2ok1.5) ...
Selecting previously unselected package libqt5quick5:amd64.
Preparing to unpack .../128-libqt5quick5_5.15.10+dfsg-2ok1.5_amd64.deb ...
Unpacking libqt5quick5:amd64 (5.15.10+dfsg-2ok1.5) ...
Selecting previously unselected package libqt5quickwidgets5:amd64.
Preparing to unpack .../129-libqt5quickwidgets5_5.15.10+dfsg-2ok1.5_amd64.deb ...
Unpacking libqt5quickwidgets5:amd64 (5.15.10+dfsg-2ok1.5) ...
Selecting previously unselected package libqt5sql5-sqlite:amd64.
Preparing to unpack .../130-libqt5sql5-sqlite_5.15.10+dfsg-3ok2.13_amd64.deb ...
Unpacking libqt5sql5-sqlite:amd64 (5.15.10+dfsg-3ok2.13) ...
Selecting previously unselected package libqt5x11extras5-dev:amd64.
Preparing to unpack .../131-libqt5x11extras5-dev_5.15.10-2ok1_amd64.deb ...
Unpacking libqt5x11extras5-dev:amd64 (5.15.10-2ok1) ...
Selecting previously unselected package libxkbcommon-dev:amd64.
Preparing to unpack .../132-libxkbcommon-dev_1.5.0-ok1_amd64.deb ...
Unpacking libxkbcommon-dev:amd64 (1.5.0-ok1) ...
Selecting previously unselected package qdoc-qt5.
Preparing to unpack .../133-qdoc-qt5_5.15.10-5ok1.5_amd64.deb ...
Unpacking qdoc-qt5 (5.15.10-5ok1.5) ...
Selecting previously unselected package qhelpgenerator-qt5.
Preparing to unpack .../134-qhelpgenerator-qt5_5.15.10-5ok1.5_amd64.deb ...
Unpacking qhelpgenerator-qt5 (5.15.10-5ok1.5) ...
Selecting previously unselected package qt5-assistant.
Preparing to unpack .../135-qt5-assistant_5.15.10-5ok1.5_amd64.deb ...
Unpacking qt5-assistant (5.15.10-5ok1.5) ...
Selecting previously unselected package qtattributionsscanner-qt5.
Preparing to unpack .../136-qtattributionsscanner-qt5_5.15.10-5ok1.5_amd64.deb ...
Unpacking qtattributionsscanner-qt5 (5.15.10-5ok1.5) ...
Selecting previously unselected package qtbase5-private-dev:amd64.
Preparing to unpack .../137-qtbase5-private-dev_5.15.10+dfsg-3ok2.13_amd64.deb ...
Unpacking qtbase5-private-dev:amd64 (5.15.10+dfsg-3ok2.13) ...
Selecting previously unselected package qttools5-dev-tools.
Preparing to unpack .../138-qttools5-dev-tools_5.15.10-5ok1.5_amd64.deb ...
Unpacking qttools5-dev-tools (5.15.10-5ok1.5) ...
Selecting previously unselected package sbuild-build-depends-main-dummy.
Preparing to unpack .../139-sbuild-build-depends-main-dummy_0.invalid.0_amd64.deb ...
Unpacking sbuild-build-depends-main-dummy (0.invalid.0) ...
Setting up media-types (10.1.0-ok1) ...
Setting up libpipeline1:amd64 (1.5.7-ok1) ...
Setting up libgraphite2-3:amd64 (1.3.14-ok1) ...
Setting up libwayland-server0:amd64 (1.23.0-1ok3) ...
Setting up libpciaccess0:amd64 (0.17-ok1) ...
Setting up libpkgconf4:amd64 (1.9.5-ok1) ...
Setting up libxau6:amd64 (1:1.0.9-ok1) ...
Setting up libxdmcp6:amd64 (1:1.1.3-ok1) ...
Setting up libdouble-conversion3:amd64 (3.3.0-ok1) ...
Setting up libxcb1:amd64 (1.15-ok2) ...
Setting up libxcb-xfixes0:amd64 (1.15-ok2) ...
Setting up bsdextrautils (2.39.3-ok2build5) ...
Setting up libxcb-xinput0:amd64 (1.15-ok2) ...
Setting up libmagic-mgc (1:5.45-ok1) ...
Setting up libxcb-render0:amd64 (1.15-ok2) ...
Setting up libarchive-zip-perl (1.68-ok1) ...
Setting up libglvnd0:amd64 (1.7.0-ok1) ...
Setting up libxcb-glx0:amd64 (1.15-ok2) ...
Setting up libdebhelper-perl (13.15.3-ok1) ...
Setting up libbrotli1:amd64 (1.1.0-ok1) ...
Setting up libedit2:amd64 (3.1-20230828-ok1) ...
Setting up libmagic1t64:amd64 (1:5.45-ok1) ...
Setting up libxcb-keysyms1:amd64 (0.4.0-ok1) ...
Setting up libxcb-shape0:amd64 (1.15-ok2) ...
Setting up x11-common (1:7.7+23-ok1) ...
Running in chroot, ignoring request.
invoke-rc.d: policy-rc.d denied execution of start.
Setting up libsensors-config (1:3.6.0-ok1) ...
Setting up libkf5windowsystem-data (5.92.0-ok5.3) ...
Setting up gettext-base (0.22-ok3) ...
Setting up m4 (1.4.19-ok1) ...
Setting up libxcb-render-util0:amd64 (0.3.9-ok1) ...
Setting up xkb-data (2.41-ok1) ...
Setting up libxcb-shm0:amd64 (1.15-ok2) ...
Setting up libxcb-icccm4:amd64 (0.4.1-ok1) ...
Setting up file (1:5.45-ok1) ...
Setting up libffi-dev:amd64 (3.4.6-ok2) ...
Setting up libpthread-stubs0-dev:amd64 (0.4-ok2) ...
Setting up libpcre2-16-0:amd64 (10.42-4ok2) ...
Setting up libopengl0:amd64 (1.7.0-ok1) ...
Setting up libelf1t64:amd64 (0.190-ok3) ...
Setting up libxcb-util1:amd64 (0.4.0-ok2) ...
Setting up libxcb-xkb1:amd64 (1.15-ok2) ...
Setting up libxcb-image0:amd64 (0.4.0-ok1) ...
Setting up libxcb-present0:amd64 (1.15-ok2) ...
Setting up xtrans-dev (1.4.0-ok1) ...
Setting up autotools-dev (20220506-ok1) ...
Setting up libz3-4:amd64 (4.8.12-ok1) ...
Setting up libpcre2-32-0:amd64 (10.42-4ok2) ...
Setting up libglib2.0-0t64:amd64 (2.80.0-ok1.2~1128) ...
No schema files found: doing nothing.
Setting up libglib2.0-data (2.80.0-ok1.2~1128) ...
Setting up libxcb-xinerama0:amd64 (1.15-ok2) ...
Setting up libexpat1-dev:amd64 (2.6.0-ok1) ...
Setting up libjpeg62-turbo:amd64 (1:2.1.2-ok2) ...
Setting up qt5-qmake-bin (5.15.10+dfsg-3ok2.13) ...
Setting up libfreetype6:amd64 (2.13.2+dfsg-ok1) ...
Setting up libx11-data (2:1.8.7-ok1) ...
Setting up libxcb-sync1:amd64 (1.15-ok2) ...
Setting up uuid-dev:amd64 (2.39.3-ok2build5) ...
Setting up libavahi-common-data:amd64 (0.8-ok1) ...
Setting up libdbus-1-3:amd64 (1.14.10-ok3) ...
Setting up autopoint (0.22-ok3) ...
Setting up fonts-dejavu-core (2.37-ok1) ...
Setting up libudev-dev:amd64 (255.2-ok1.12) ...
Setting up libsepol-dev:amd64 (3.5-ok1) ...
Setting up ucf (3.0043+nmu1-ok1) ...
Setting up pkgconf-bin (1.9.5-ok1) ...
Setting up gir1.2-glib-2.0:amd64 (2.80.0-ok1.2~1128) ...
Setting up libsensors5:amd64 (1:3.6.0-ok1) ...
Setting up libglapi-mesa:amd64 (24.0.5-ok1) ...
Setting up libvulkan1:amd64 (1.3.275.0-ok2) ...
Setting up autoconf (2.71-ok3) ...
Setting up libicu74:amd64 (74.2-ok6) ...
Setting up libxcb-dri2-0:amd64 (1.15-ok2) ...
Setting up zlib1g-dev:amd64 (1:1.3.dfsg-ok3) ...
Setting up libpcre2-posix3:amd64 (10.42-4ok2) ...
Setting up dwz (0.15-1ok1) ...
Setting up libmtdev1t64:amd64 (1.1.6-ok1) ...
Setting up libxshmfence1:amd64 (1.3-ok1) ...
Setting up libxcb-randr0:amd64 (1.15-ok2) ...
Setting up dbus-session-bus-common (1.14.10-ok3) ...
Setting up libuchardet0:amd64 (0.0.8-ok1) ...
Setting up libmd4c0:amd64 (0.4.8-ok1) ...
Setting up libsub-override-perl (0.10-ok1) ...
Setting up libx11-6:amd64 (2:1.8.7-ok1) ...
Setting up libharfbuzz0b:amd64 (8.3.0-ok2) ...
Setting up xorg-sgml-doctools (1:1.11-ok1) ...
Setting up netbase (6.4-ok1) ...
Setting up libglu1-mesa:amd64 (9.0.2-ok1) ...
Setting up libopengl-dev:amd64 (1.7.0-ok1) ...
Setting up dbus-system-bus-common (1.14.10-ok3) ...
Setting up libdrm-common (2.4.120-ok1) ...
Setting up libevdev2:amd64 (1.13.1+dfsg-ok1) ...
Setting up dbus-bin (1.14.10-ok3) ...
Setting up libbrotli-dev:amd64 (1.1.0-ok1) ...
Setting up libgudev-1.0-0:amd64 (1:238-ok2) ...
Setting up qtchooser (66-ok2) ...
Setting up kwayland-data (4:5.92.0-ok4.3) ...
Setting up libpopt0:amd64 (1.19+dfsg-1ok1.0) ...
Setting up libicu70:amd64 (70.1-ok2) ...
Setting up libkysdk-basecommon:amd64 (2.5.1.0-0k0.6) ...
Setting up libwacom-common (1.3-ok3.2) ...
Setting up libbz2-dev:amd64 (1.0.8.2-0k0) ...
Setting up libxkbcommon0:amd64 (1.5.0-ok1) ...
Setting up libwayland-client0:amd64 (1.23.0-1ok3) ...
Setting up automake (1:1.16.5-ok1) ...
update-alternatives: using /usr/bin/automake-1.16 to provide /usr/bin/automake (automake) in auto mode
Setting up logrotate (3.21.0-ok1) ...
Created symlink /etc/systemd/system/timers.target.wants/logrotate.timer → /usr/lib/systemd/system/logrotate.timer.
Setting up x11proto-dev (2024.1-1ok3) ...
Setting up libfile-stripnondeterminism-perl (1.13.1-ok1) ...
Setting up libxcb-dri3-0:amd64 (1.15-ok2) ...
Setting up libblkid-dev:amd64 (2.39.3-ok2build5) ...
Setting up libx11-xcb1:amd64 (2:1.8.7-ok1) ...
Setting up libice6:amd64 (2:1.0.10-ok1) ...
Setting up libxcb-res0:amd64 (1.15-ok2) ...
Setting up libxau-dev:amd64 (1:1.0.9-ok1) ...
Setting up libpython3.12-stdlib:amd64 (3.12.2-ok4.1) ...
Setting up qt5-qmake:amd64 (5.15.10+dfsg-3ok2.13) ...
Setting up libpcre2-dev:amd64 (10.42-4ok2) ...
Setting up libxrender1:amd64 (1:0.9.10-ok1) ...
Setting up libevdev-dev:amd64 (1.13.1+dfsg-ok1) ...
Setting up libtool (2.4.7-ok2) ...
Setting up libgirepository-2.0-0:amd64 (2.80.0-ok1.2~1128) ...
Setting up libselinux1-dev:amd64 (3.5-ok2) ...
Setting up libmtdev-dev:amd64 (1.1.6-ok1) ...
Setting up fontconfig-config (2.15.0-ok5) ...
Setting up libxkbcommon-dev:amd64 (1.5.0-ok1) ...
Setting up python3.12 (3.12.2-ok4.1) ...
Setting up libpng-dev:amd64 (1.6.43-ok1) ...
Setting up libavahi-common3:amd64 (0.8-ok1) ...
Setting up libxext6:amd64 (2:1.3.4-ok2) ...
Setting up libglib2.0-bin (2.80.0-ok1.2~1128) ...
Setting up dbus-daemon (1.14.10-ok3) ...
Setting up pkgconf:amd64 (1.9.5-ok1) ...
Setting up libxxf86vm1:amd64 (1:1.1.4-ok1) ...
Setting up libfreetype-dev:amd64 (2.13.2+dfsg-ok1) ...
Setting up dh-autoreconf (20-ok1) ...
Setting up libxdmcp-dev:amd64 (1:1.1.3-ok1) ...
Setting up libkysdk-utils:amd64 (2.5.1.0-0k0.6) ...
Setting up libxfixes3:amd64 (1:6.0.0-ok1) ...
Setting up libdbus-glib-1-2:amd64 (0.112-ok1) ...
Setting up x11proto-core-dev (2024.1-1ok3) ...
Setting up dbus (1.14.10-ok3) ...
Running in chroot, ignoring request.
invoke-rc.d: policy-rc.d denied execution of start.
Setting up gir1.2-gudev-1.0:amd64 (1:238-ok2) ...
Setting up libxkbcommon-x11-0:amd64 (1.5.0-ok1) ...
Setting up dh-strip-nondeterminism (1.13.1-ok1) ...
Setting up libdrm2:amd64 (2.4.120-ok1) ...
Setting up libkysdk-timer:amd64 (2.5.1.0-0k0.6) ...
Setting up groff-base (1.23.0-3ok1) ...
Setting up libfontconfig1:amd64 (2.15.0-ok5) ...
Setting up libwacom2:amd64 (1.3-ok3.2) ...
Setting up libsm6:amd64 (2:1.2.3-ok1) ...
Setting up libxml2:amd64 (2.9.14+dfsg-ok2) ...
Setting up libavahi-client3:amd64 (0.8-ok1) ...
Setting up libmount-dev:amd64 (2.39.3-ok2build5) ...
Setting up libpython3-stdlib:amd64 (3.12.2-ok1) ...
Setting up libdrm-amdgpu1:amd64 (2.4.120-ok1) ...
Setting up fontconfig (2.15.0-ok5) ...
Regenerating fonts cache... done.
Setting up libkysdk-utils-dev (2.5.1.0-0k0.6) ...
Setting up libdrm-nouveau2:amd64 (2.4.120-ok1) ...
Setting up gettext (0.22-ok3) ...
Setting up libxcb1-dev:amd64 (1.15-ok2) ...
Setting up libkysdk-config:amd64 (2.5.1.0-0k0.6) ...
Setting up libgbm1:amd64 (24.0.5-ok1) ...
Setting up libfontconfig-dev:amd64 (2.15.0-ok5) ...
Setting up libdrm-radeon1:amd64 (2.4.120-ok1) ...
Setting up libdrm-intel1:amd64 (2.4.120-ok1) ...
Setting up libkysdk-timer-dev (2.5.1.0-0k0.6) ...
Setting up libx11-dev:amd64 (2:1.8.7-ok1) ...
Setting up python3 (3.12.2-ok1) ...
Setting up man-db (2.12.0-ok1) ...
Not building database; man-db/auto-update is not 'true'.
Created symlink /etc/systemd/system/timers.target.wants/man-db.timer → /usr/lib/systemd/system/man-db.timer.
Setting up libinput-bin (1.25.0-ok1.2) ...
Setting up intltool-debian (0.35.0+20060710.5-ok2) ...
Setting up libegl-mesa0:amd64 (24.0.5-ok1) ...
Setting up python3-packaging (24.0-ok1) ...
Setting up libllvm17t64:amd64 (1:17.0.6-9ok4) ...
Setting up shared-mime-info (2.2-ok6.1) ...
Setting up libqt5core5a:amd64 (5.15.10+dfsg-3ok2.13) ...
Setting up libkysdk-config-dev (2.5.1.0-0k0.6) ...
Setting up libxext-dev:amd64 (2:1.3.4-ok2) ...
Setting up libqt5dbus5:amd64 (5.15.10+dfsg-3ok2.13) ...
Setting up libllvm15:amd64 (1:15.0.7-ok3) ...
Setting up libegl1:amd64 (1.7.0-ok1) ...
Setting up libqt5test5:amd64 (5.15.10+dfsg-3ok2.13) ...
Setting up libcups2t64:amd64 (2.4.7-ok2) ...
Setting up libqt5concurrent5:amd64 (5.15.10+dfsg-3ok2.13) ...
Setting up libglib2.0-dev-bin (2.80.0-ok1.2~1128) ...
Setting up libinput10:amd64 (1.25.0-ok1.2) ...
Setting up libkysdk-log:amd64 (2.5.1.0-0k0.6) ...
Setting up libkysdk-systime:amd64 (2.5.1.2-0k1.8) ...
kvm
Running in chroot, ignoring command 'daemon-reload'
Created symlink /etc/systemd/system/multi-user.target.wants/kysdk-systime.service → /usr/lib/systemd/system/kysdk-systime.service.
Running in chroot, ignoring command 'restart'
Setting up libvulkan-dev:amd64 (1.3.275.0-ok2) ...
Setting up po-debconf (1.0.21+nmu1-ok1) ...
Setting up libgl1-mesa-dri:amd64 (24.0.5-ok1) ...
Setting up libqt5script5:amd64 (5.15.10+dfsg-2ok1.3) ...
Setting up debhelper (13.15.3-ok1) ...
Setting up libgsettings-qt1:amd64 (0.2-ok1) ...
Setting up libclang1-15 (1:15.0.7-ok3) ...
Setting up libqt5network5:amd64 (5.15.10+dfsg-3ok2.13) ...
Setting up libqt5sql5:amd64 (5.15.10+dfsg-3ok2.13) ...
Setting up qtbase5-dev-tools (5.15.10+dfsg-3ok2.13) ...
Setting up libqt5xml5:amd64 (5.15.10+dfsg-3ok2.13) ...
Setting up libglib2.0-dev:amd64 (2.80.0-ok1.2~1128) ...
Setting up libqt5qml5:amd64 (5.15.10+dfsg-2ok1.5) ...
Setting up qtattributionsscanner-qt5 (5.15.10-5ok1.5) ...
Setting up libgsettings-qt-dev:amd64 (0.2-ok1) ...
Setting up libqt5qmlmodels5:amd64 (5.15.10+dfsg-2ok1.5) ...
Setting up libglx-mesa0:amd64 (24.0.5-ok1) ...
Setting up libkysdk-systime-dev (2.5.1.2-0k1.8) ...
Setting up libqt5sql5-sqlite:amd64 (5.15.10+dfsg-3ok2.13) ...
Setting up libglx0:amd64 (1.7.0-ok1) ...
Setting up qdoc-qt5 (5.15.10-5ok1.5) ...
Setting up libgudev-1.0-dev:amd64 (1:238-ok2) ...
Setting up libgl1:amd64 (1.7.0-ok1) ...
Setting up libglx-dev:amd64 (1.7.0-ok1) ...
Setting up libgl-dev:amd64 (1.7.0-ok1) ...
Setting up libwacom-dev:amd64 (1.3-ok3.2) ...
Setting up libegl-dev:amd64 (1.7.0-ok1) ...
Setting up libqt5gui5:amd64 (5.15.10+dfsg-3ok2.13) ...
Setting up libqt5widgets5:amd64 (5.15.10+dfsg-3ok2.13) ...
Setting up libqt5help5:amd64 (5.15.10-5ok1.5) ...
Setting up libqt5printsupport5:amd64 (5.15.10+dfsg-3ok2.13) ...
Setting up libinput-dev:amd64 (1.25.0-ok1.2) ...
Setting up libglu1-mesa-dev:amd64 (9.0.2-ok1) ...
Setting up libkf5waylandclient5:amd64 (4:5.92.0-ok4.3) ...
Setting up qtbase5-dev:amd64 (5.15.10+dfsg-3ok2.13) ...
Setting up qt5-assistant (5.15.10-5ok1.5) ...
Setting up libqt5quick5:amd64 (5.15.10+dfsg-2ok1.5) ...
Setting up libqt5scripttools5:amd64 (5.15.10+dfsg-2ok1.3) ...
Setting up libqt5x11extras5:amd64 (5.15.10-2ok1) ...
Setting up qtbase5-private-dev:amd64 (5.15.10+dfsg-3ok2.13) ...
Setting up libqt5designer5:amd64 (5.15.10-5ok1.5) ...
Setting up qtscript5-dev:amd64 (5.15.10+dfsg-2ok1.3) ...
Setting up libqt5svg5:amd64 (5.15.10-2ok1) ...
Setting up qhelpgenerator-qt5 (5.15.10-5ok1.5) ...
Setting up libqt5designercomponents5:amd64 (5.15.10-5ok1.5) ...
Setting up libqt5quickwidgets5:amd64 (5.15.10+dfsg-2ok1.5) ...
Setting up qttools5-dev-tools (5.15.10-5ok1.5) ...
Setting up libkf5windowsystem5:amd64 (5.92.0-ok5.3) ...
Setting up libqt5x11extras5-dev:amd64 (5.15.10-2ok1) ...
Setting up libkf5windowsystem-dev (5.92.0-ok5.3) ...
Setting up libkysdk-waylandhelper (2.5.1.0-0k9.1) ...
Setting up libkysdk-waylandhelper-dev (2.5.1.0-0k9.1) ...
Setting up libkysdk-qtwidgets (2.5.1.0-0k9.1) ...
Setting up libkysdk-qtwidgets-dev (2.5.1.0-0k9.1) ...
Setting up sbuild-build-depends-main-dummy (0.invalid.0) ...
Processing triggers for systemd (255.2-ok1.12) ...
Processing triggers for libc-bin (2.38-1ok6.9) ...
Processing triggers for dbus (1.14.10-ok3) ...

+------------------------------------------------------------------------------+
| Check architectures                                                          |
+------------------------------------------------------------------------------+

Arch check ok (amd64 included in any)

+------------------------------------------------------------------------------+
| Build environment                                                            |
+------------------------------------------------------------------------------+

Kernel: Linux 5.4.0-126-generic #142-Ubuntu SMP Fri Aug 26 12:12:57 UTC 2022 amd64 (x86_64)
Toolchain package versions: binutils_2.41-ok13 dpkg-dev_1.22.6-ok3 g++-12_12.3.0-1ok3 gcc-12_12.3.0-1ok3 gcc-9_9.3.0-ok12 libc6-dev_2.38-1ok6.9 libstdc++-12-dev_12.3.0-1ok3 libstdc++6_13.2.0-4ok3.3 linux-libc-dev_6.6.0-15.0ok13
Package versions: adduser_3.137-ok1 advancecomp_2.5-ok1 apt_2.8.0-ok2 autoconf_2.71-ok3 automake_1:1.16.5-ok1 autopoint_0.22-ok3 autotools-dev_20220506-ok1 base-files_13-ok2.2 base-passwd_3.6.3-ok2 bash_5.2.21-ok1 binutils_2.41-ok13 binutils-common_2.41-ok13 binutils-x86-64-linux-gnu_2.41-ok13 bsdextrautils_2.39.3-ok2build5 bsdutils_1:2.39.3-ok2build5 build-essential_12.8-ok1 bzip2_1.0.8.2-0k0 ca-certificates_20240203-ok1 coreutils_9.4-ok4 cpp_4:12.2.0-ok1 cpp-12_12.3.0-1ok3 cpp-9_9.3.0-ok12 dash_0.5.12-ok1 dbus_1.14.10-ok3 dbus-bin_1.14.10-ok3 dbus-daemon_1.14.10-ok3 dbus-session-bus-common_1.14.10-ok3 dbus-system-bus-common_1.14.10-ok3 debconf_1.5.86-ok1 debhelper_13.15.3-ok1 debianutils_5.17-ok2 dh-autoreconf_20-ok1 dh-strip-nondeterminism_1.13.1-ok1 diffutils_1:3.7-ok1 dmsetup_2:1.02.196-ok2 dpkg_1.22.6-ok3 dpkg-dev_1.22.6-ok3 dwz_0.15-1ok1 e2fsprogs_1.47.0-ok1 fakeroot_1.30.1-ok2 fdisk_2.39.3-ok2build5 file_1:5.45-ok1 findutils_4.9.0-ok2 fontconfig_2.15.0-ok5 fontconfig-config_2.15.0-ok5 fonts-dejavu-core_2.37-ok1 g++_4:12.2.0-ok1 g++-12_12.3.0-1ok3 gcc_4:12.2.0-ok1 gcc-10-base_10-20200411-ok5 gcc-12_12.3.0-1ok3 gcc-12-base_12.3.0-1ok3 gcc-13-base_13.2.0-4ok3.3 gcc-9_9.3.0-ok12 gcc-9-base_9.3.0-ok12 gettext_0.22-ok3 gettext-base_0.22-ok3 gir1.2-glib-2.0_2.80.0-ok1.2~1128 gir1.2-gudev-1.0_1:238-ok2 gpg_2.4.3-ok11 gpg-agent_2.4.3-ok11 gpgconf_2.4.3-ok11 gpgv_2.4.3-ok11 grep_3.11-ok3 groff-base_1.23.0-3ok1 gzip_1.12-1ok3 hostname_3.23-ok3 init_1.66-ok1 init-system-helpers_1.66-ok1 intltool-debian_0.35.0+20060710.5-ok2 kwayland-data_4:5.92.0-ok4.3 libacl1_2.3.1-ok1 libapparmor1_4.0.0-beta3-ok1 libapt-pkg6.0t64_2.8.0-ok2 libarchive-zip-perl_1.68-ok1 libargon2-1_0~20190702+dfsg-ok1 libasan5_9.3.0-ok12 libasan8_13.2.0-4ok3.3 libassuan0_2.5.6-ok1 libatomic1_13.2.0-4ok3.3 libattr1_1:2.5.1-4ok1 libaudit-common_1:3.1.2-ok1.2 libaudit1_1:3.1.2-ok1.2 libavahi-client3_0.8-ok1 libavahi-common-data_0.8-ok1 libavahi-common3_0.8-ok1 libbinutils_2.41-ok13 libblkid-dev_2.39.3-ok2build5 libblkid1_2.39.3-ok2build5 libbrotli-dev_1.1.0-ok1 libbrotli1_1.1.0-ok1 libbsd0_0.11.7-4ok1 libbz2-1.0_1.0.8.2-0k0 libbz2-dev_1.0.8.2-0k0 libc-bin_2.38-1ok6.9 libc-dev-bin_2.38-1ok6.9 libc6_2.38-1ok6.9 libc6-dev_2.38-1ok6.9 libcap-ng0_0.8.4-ok2 libcap2_1:2.69-1ok2 libcc1-0_13.2.0-4ok3.3 libclang1-15_1:15.0.7-ok3 libcom-err2_1.47.0-ok1 libcrypt-dev_1:4.4.36-ok2 libcrypt1_1:4.4.36-ok2 libcryptsetup12_2:2.6.1-ok7 libctf-nobfd0_2.41-ok13 libctf0_2.41-ok13 libcups2t64_2.4.7-ok2 libdb5.3_5.3.28+dfsg1-ok1 libdbus-1-3_1.14.10-ok3 libdbus-glib-1-2_0.112-ok1 libdebconfclient0_0.271-ok1 libdebhelper-perl_13.15.3-ok1 libdevmapper1.02.1_2:1.02.196-ok2 libdouble-conversion3_3.3.0-ok1 libdpkg-perl_1.22.6-ok3 libdrm-amdgpu1_2.4.120-ok1 libdrm-common_2.4.120-ok1 libdrm-intel1_2.4.120-ok1 libdrm-nouveau2_2.4.120-ok1 libdrm-radeon1_2.4.120-ok1 libdrm2_2.4.120-ok1 libedit2_3.1-20230828-ok1 libegl-dev_1.7.0-ok1 libegl-mesa0_24.0.5-ok1 libegl1_1.7.0-ok1 libelf1t64_0.190-ok3 libevdev-dev_1.13.1+dfsg-ok1 libevdev2_1.13.1+dfsg-ok1 libexpat1_2.6.0-ok1 libexpat1-dev_2.6.0-ok1 libext2fs2_1.47.0-ok1 libfakeroot_1.30.1-ok2 libfdisk1_2.39.3-ok2build5 libffi-dev_3.4.6-ok2 libffi7_3.3-ok1 libffi8_3.4.6-ok2 libfile-stripnondeterminism-perl_1.13.1-ok1 libfontconfig-dev_2.15.0-ok5 libfontconfig1_2.15.0-ok5 libfreetype-dev_2.13.2+dfsg-ok1 libfreetype6_2.13.2+dfsg-ok1 libgbm1_24.0.5-ok1 libgcc-12-dev_12.3.0-1ok3 libgcc-9-dev_9.3.0-ok12 libgcc-s1_13.2.0-4ok3.3 libgcrypt20_1.10.3-ok2 libgdbm-compat4_1.18.1-ok2 libgdbm6_1.18.1-ok2 libgirepository-2.0-0_2.80.0-ok1.2~1128 libgl-dev_1.7.0-ok1 libgl1_1.7.0-ok1 libgl1-mesa-dri_24.0.5-ok1 libglapi-mesa_24.0.5-ok1 libglib2.0-0t64_2.80.0-ok1.2~1128 libglib2.0-bin_2.80.0-ok1.2~1128 libglib2.0-data_2.80.0-ok1.2~1128 libglib2.0-dev_2.80.0-ok1.2~1128 libglib2.0-dev-bin_2.80.0-ok1.2~1128 libglu1-mesa_9.0.2-ok1 libglu1-mesa-dev_9.0.2-ok1 libglvnd0_1.7.0-ok1 libglx-dev_1.7.0-ok1 libglx-mesa0_24.0.5-ok1 libglx0_1.7.0-ok1 libgmp10_2:6.3.0+dfsg-ok5 libgnutls30t64_3.8.3-ok3 libgomp1_13.2.0-4ok3.3 libgpg-error0_1.47-ok1 libgprofng0_2.41-ok13 libgraphite2-3_1.3.14-ok1 libgsettings-qt-dev_0.2-ok1 libgsettings-qt1_0.2-ok1 libgssapi-krb5-2_1.20.1-ok1 libgudev-1.0-0_1:238-ok2 libgudev-1.0-dev_1:238-ok2 libharfbuzz0b_8.3.0-ok2 libhogweed5_3.5.1+really3.5.1-ok3 libhogweed6t64_3.9.1-ok2 libice6_2:1.0.10-ok1 libicu70_70.1-ok2 libicu74_74.2-ok6 libidn2-0_2.3.7-ok2 libinput-bin_1.25.0-ok1.2 libinput-dev_1.25.0-ok1.2 libinput10_1.25.0-ok1.2 libip4tc2_1.8.10-ok1 libisl23_0.26-ok1 libitm1_13.2.0-4ok3.3 libjansson4_2.14-ok1 libjpeg62-turbo_1:2.1.2-ok2 libjson-c5_0.17-ok1 libk5crypto3_1.20.1-ok1 libkeyutils1_1.6.3-ok2 libkf5waylandclient5_4:5.92.0-ok4.3 libkf5windowsystem-data_5.92.0-ok5.3 libkf5windowsystem-dev_5.92.0-ok5.3 libkf5windowsystem5_5.92.0-ok5.3 libkmod2_30-ok2 libkrb5-3_1.20.1-ok1 libkrb5support0_1.20.1-ok1 libkysdk-basecommon_2.5.1.0-0k0.6 libkysdk-config_2.5.1.0-0k0.6 libkysdk-config-dev_2.5.1.0-0k0.6 libkysdk-log_2.5.1.0-0k0.6 libkysdk-qtwidgets_2.5.1.0-0k9.1 libkysdk-qtwidgets-dev_2.5.1.0-0k9.1 libkysdk-systime_2.5.1.2-0k1.8 libkysdk-systime-dev_2.5.1.2-0k1.8 libkysdk-timer_2.5.1.0-0k0.6 libkysdk-timer-dev_2.5.1.0-0k0.6 libkysdk-utils_2.5.1.0-0k0.6 libkysdk-utils-dev_2.5.1.0-0k0.6 libkysdk-waylandhelper_2.5.1.0-0k9.1 libkysdk-waylandhelper-dev_2.5.1.0-0k9.1 libllvm15_1:15.0.7-ok3 libllvm17t64_1:17.0.6-9ok4 liblockfile-bin_1.17-ok1 liblockfile1_1.17-ok1 liblsan0_13.2.0-4ok3.3 liblz4-1_1.9.4-1ok1 liblzma5_5.4.5-ok2 libmagic-mgc_1:5.45-ok1 libmagic1t64_1:5.45-ok1 libmd0_1.1.0-ok1 libmd4c0_0.4.8-ok1 libmount-dev_2.39.3-ok2build5 libmount1_2.39.3-ok2build5 libmpc3_1.3.1-ok1 libmpfr6_4.2.1-ok4 libmtdev-dev_1.1.6-ok1 libmtdev1t64_1.1.6-ok1 libncurses6_6.4+20240113-1ok1 libncursesw6_6.4+20240113-1ok1 libnettle7_3.5.1+really3.5.1-ok3 libnettle8t64_3.9.1-ok2 libnpth0t64_1.6-ok2 libnsl-dev_2.0.0-ok2 libnsl2_2.0.0-ok2 libopengl-dev_1.7.0-ok1 libopengl0_1.7.0-ok1 libp11-kit0_0.25.3-ok1 libpam-modules_1.5.3-ok7 libpam-modules-bin_1.5.3-ok7 libpam-runtime_1.5.3-ok7 libpam0g_1.5.3-ok7 libpciaccess0_0.17-ok1 libpcre2-16-0_10.42-4ok2 libpcre2-32-0_10.42-4ok2 libpcre2-8-0_10.42-4ok2 libpcre2-dev_10.42-4ok2 libpcre2-posix3_10.42-4ok2 libpcre3_2:8.39-ok3 libperl5.36_5.36.0-ok8.1 libpipeline1_1.5.7-ok1 libpkgconf4_1.9.5-ok1 libpng-dev_1.6.43-ok1 libpng16-16t64_1.6.43-ok1 libpopt0_1.19+dfsg-1ok1.0 libproc2-0_2:4.0.4-ok1.0 libprocps8_2:3.3.16-ok1 libpthread-stubs0-dev_0.4-ok2 libpython3-stdlib_3.12.2-ok1 libpython3.12-minimal_3.12.2-ok4.1 libpython3.12-stdlib_3.12.2-ok4.1 libqt5concurrent5_5.15.10+dfsg-3ok2.13 libqt5core5a_5.15.10+dfsg-3ok2.13 libqt5dbus5_5.15.10+dfsg-3ok2.13 libqt5designer5_5.15.10-5ok1.5 libqt5designercomponents5_5.15.10-5ok1.5 libqt5gui5_5.15.10+dfsg-3ok2.13 libqt5help5_5.15.10-5ok1.5 libqt5network5_5.15.10+dfsg-3ok2.13 libqt5printsupport5_5.15.10+dfsg-3ok2.13 libqt5qml5_5.15.10+dfsg-2ok1.5 libqt5qmlmodels5_5.15.10+dfsg-2ok1.5 libqt5quick5_5.15.10+dfsg-2ok1.5 libqt5quickwidgets5_5.15.10+dfsg-2ok1.5 libqt5script5_5.15.10+dfsg-2ok1.3 libqt5scripttools5_5.15.10+dfsg-2ok1.3 libqt5sql5_5.15.10+dfsg-3ok2.13 libqt5sql5-sqlite_5.15.10+dfsg-3ok2.13 libqt5svg5_5.15.10-2ok1 libqt5test5_5.15.10+dfsg-3ok2.13 libqt5widgets5_5.15.10+dfsg-3ok2.13 libqt5x11extras5_5.15.10-2ok1 libqt5x11extras5-dev_5.15.10-2ok1 libqt5xml5_5.15.10+dfsg-3ok2.13 libquadmath0_13.2.0-4ok3.3 libreadline8_8.2-ok1 libseccomp2_2.5.5-1ok1.3 libselinux1_3.5-ok2 libselinux1-dev_3.5-ok2 libsemanage-common_3.5-ok1 libsemanage2_3.5-ok1 libsensors-config_1:3.6.0-ok1 libsensors5_1:3.6.0-ok1 libsepol-dev_3.5-ok1 libsepol2_3.5-ok1 libsframe1_2.41-ok13 libsm6_2:1.2.3-ok1 libsmartcols1_2.39.3-ok2build5 libsqlite3-0_3.42.0-ok1 libss2_1.47.0-ok1 libssl3t64_3.2.1-ok7 libstdc++-12-dev_12.3.0-1ok3 libstdc++6_13.2.0-4ok3.3 libsub-override-perl_0.10-ok1 libsystemd-shared_255.2-ok1.12 libsystemd0_255.2-ok1.12 libtasn1-6_4.19.0-ok1 libtinfo6_6.4+20240113-1ok1 libtirpc-common_1.3.4+ds-ok1 libtirpc-dev_1.3.4+ds-ok1 libtirpc3t64_1.3.4+ds-ok1 libtool_2.4.7-ok2 libtsan0_10-20200411-ok5 libtsan2_13.2.0-4ok3.3 libubsan1_13.2.0-4ok3.3 libuchardet0_0.0.8-ok1 libudev-dev_255.2-ok1.12 libudev1_255.2-ok1.12 libunistring2_0.9.10-ok1 libunistring5_1.1-ok1 libuuid1_2.39.3-ok2build5 libvulkan-dev_1.3.275.0-ok2 libvulkan1_1.3.275.0-ok2 libwacom-common_1.3-ok3.2 libwacom-dev_1.3-ok3.2 libwacom2_1.3-ok3.2 libwayland-client0_1.23.0-1ok3 libwayland-server0_1.23.0-1ok3 libx11-6_2:1.8.7-ok1 libx11-data_2:1.8.7-ok1 libx11-dev_2:1.8.7-ok1 libx11-xcb1_2:1.8.7-ok1 libxau-dev_1:1.0.9-ok1 libxau6_1:1.0.9-ok1 libxcb-dri2-0_1.15-ok2 libxcb-dri3-0_1.15-ok2 libxcb-glx0_1.15-ok2 libxcb-icccm4_0.4.1-ok1 libxcb-image0_0.4.0-ok1 libxcb-keysyms1_0.4.0-ok1 libxcb-present0_1.15-ok2 libxcb-randr0_1.15-ok2 libxcb-render-util0_0.3.9-ok1 libxcb-render0_1.15-ok2 libxcb-res0_1.15-ok2 libxcb-shape0_1.15-ok2 libxcb-shm0_1.15-ok2 libxcb-sync1_1.15-ok2 libxcb-util1_0.4.0-ok2 libxcb-xfixes0_1.15-ok2 libxcb-xinerama0_1.15-ok2 libxcb-xinput0_1.15-ok2 libxcb-xkb1_1.15-ok2 libxcb1_1.15-ok2 libxcb1-dev_1.15-ok2 libxdmcp-dev_1:1.1.3-ok1 libxdmcp6_1:1.1.3-ok1 libxext-dev_2:1.3.4-ok2 libxext6_2:1.3.4-ok2 libxfixes3_1:6.0.0-ok1 libxkbcommon-dev_1.5.0-ok1 libxkbcommon-x11-0_1.5.0-ok1 libxkbcommon0_1.5.0-ok1 libxml2_2.9.14+dfsg-ok2 libxrender1_1:0.9.10-ok1 libxshmfence1_1.3-ok1 libxxf86vm1_1:1.1.4-ok1 libxxhash0_0.8.2-ok1 libz3-4_4.8.12-ok1 libzstd1_1.5.5-ok3 linux-libc-dev_6.6.0-15.0ok13 lockfile-progs_0.1.19-ok1 login_1:4.14.3-ok3.5 logrotate_3.21.0-ok1 logsave_1.47.0-ok1 lsb-base_11.6-ok1 lto-disabled-list_24-ok21 m4_1.4.19-ok1 make_4.3-ok1 man-db_2.12.0-ok1 mawk_1.3.4.20240123-ok1 media-types_10.1.0-ok1 mount_2.39.3-ok2build5 ncurses-base_6.4+20240113-1ok1 ncurses-bin_6.4+20240113-1ok1 netbase_6.4-ok1 openkylin-keyring_2022.05.12-ok1 openssl_3.2.1-ok7 optipng_0.7.8+ds-ok1 passwd_1:4.14.3-ok3.5 patch_2.7.6-ok1 perl_5.36.0-ok8.1 perl-base_5.36.0-ok8.1 perl-modules-5.36_5.36.0-ok8.1 pinentry-curses_1.2.1-3ok5 pkgbinarymangler_154-ok3 pkgconf_1.9.5-ok1 pkgconf-bin_1.9.5-ok1 po-debconf_1.0.21+nmu1-ok1 policyrcd-script-zg2_0.1-ok0 procps_2:4.0.4-ok1.0 python3_3.12.2-ok1 python3-minimal_3.12.2-ok1 python3-packaging_24.0-ok1 python3.12_3.12.2-ok4.1 python3.12-minimal_3.12.2-ok4.1 qdoc-qt5_5.15.10-5ok1.5 qhelpgenerator-qt5_5.15.10-5ok1.5 qt5-assistant_5.15.10-5ok1.5 qt5-qmake_5.15.10+dfsg-3ok2.13 qt5-qmake-bin_5.15.10+dfsg-3ok2.13 qtattributionsscanner-qt5_5.15.10-5ok1.5 qtbase5-dev_5.15.10+dfsg-3ok2.13 qtbase5-dev-tools_5.15.10+dfsg-3ok2.13 qtbase5-private-dev_5.15.10+dfsg-3ok2.13 qtchooser_66-ok2 qtscript5-dev_5.15.10+dfsg-2ok1.3 qttools5-dev-tools_5.15.10-5ok1.5 readline-common_8.2-ok1 rpcsvc-proto_1.4.3-ok1 sbuild-build-depends-main-dummy_0.invalid.0 sed_4.9-2ok1 sensible-utils_0.0.22-ok1 shared-mime-info_2.2-ok6.1 systemd_255.2-ok1.12 systemd-dev_255.2-ok1.12 systemd-sysv_255.2-ok1.12 systemd-timesyncd_255.2-ok1.12 sysvinit-utils_3.08-ok1 tar_1.35+dfsg-ok1 tzdata_2024a-ok1 ubuntu-keyring_2023.11.28.1-ok1 ucf_3.0043+nmu1-ok1 util-linux_2.39.3-ok2build5 util-linux-extra_2.39.3-ok2build5 uuid-dev_2.39.3-ok2build5 x11-common_1:7.7+23-ok1 x11proto-core-dev_2024.1-1ok3 x11proto-dev_2024.1-1ok3 xkb-data_2.41-ok1 xorg-sgml-doctools_1:1.11-ok1 xtrans-dev_1.4.0-ok1 xz-utils_5.4.5-ok2 zlib1g_1:1.3.dfsg-ok3 zlib1g-dev_1:1.3.dfsg-ok3

+------------------------------------------------------------------------------+
| Build                                                                        |
+------------------------------------------------------------------------------+


Unpack source
-------------

-----BEGIN PGP SIGNED MESSAGE-----
Hash: SHA512

Format: 3.0 (native)
Source: yhkylin-backup-tools
Binary: yhkylin-backup-tools, yhkylin-backup-tools-dev
Architecture: any
Version: 4.1.0.1-ok17
Maintainer: liubuquan <liubuquan@kylinos.cn>
Homepage: http://kylinos.cn
Standards-Version: 3.9.5
Build-Depends: debhelper (>= 9), build-essential, qtbase5-dev (>= 5.1), qt5-qmake, qtchooser, qtscript5-dev, qttools5-dev-tools, qtbase5-dev-tools, qtbase5-private-dev, libblkid-dev, libkf5windowsystem-dev, libx11-dev, libqt5x11extras5-dev, libgsettings-qt-dev, libkysdk-qtwidgets-dev, libkysdk-waylandhelper-dev, libkysdk-systime-dev
Package-List:
 yhkylin-backup-tools deb utils optional arch=any
 yhkylin-backup-tools-dev deb utils optional arch=any
Checksums-Sha1:
 5762f747d89033f16e8d610be7ddf142a1c460d1 3199000 yhkylin-backup-tools_4.1.0.1-ok17.tar.xz
Checksums-Sha256:
 4b75742462d70afa23b203c2b3f0f9396731dce8c909ba3f775f3826d86d8fe6 3199000 yhkylin-backup-tools_4.1.0.1-ok17.tar.xz
Files:
 a3fd5929ffd3a35c63640337b7790737 3199000 yhkylin-backup-tools_4.1.0.1-ok17.tar.xz

-----BEGIN PGP SIGNATURE-----

iQGzBAEBCgAdFiEEZPu3n16uZNeS6Uz+BxbwD4Qs0nQFAmfanA4ACgkQBxbwD4Qs
0nT51gv8C/oMaE9HnuF/9uwFbqBeyx+AU7ACDhBcTTlI/AtAE15Sf83okMbamLwd
Qk2fxbsBJ34TZAGx/pImMtBIooqbfdZMf+nOKvdIIMtK3o8eKdaNJwzDkZUTWKyM
Ml+pplfbckhRlgTd76HK5PZpsf8dT9s2ekvFKx9MDfYocN2yl4t45MUff/F58Ahy
4U6nzn383G6c+80jSjyGF/G3H6xLFpl1t0Zwni/IKPgzpI8ob4LuK+suVkz1xc5T
o+y8oo5U0zwaviwX91eiZu7cODxDSk46c8Ur//M++lgOKWGoZ/JWHbmPqQEqlpZz
CTplSxx+xirktpzpj894h/km5Nmy01Cs86Hm/Hh3ODLhK8Qea/s4vz4nrV/bJ1AD
zOMJxH7EK6YsPNo/DwLRMBLrrywvdV7RTGRfQqWiWI7Vlg6CKK4L0RXxlK9o2uE1
sh/qnpqibBW1GBFbwAHm4Z0w26oknfVvlpCikbJG3ynHTAisb/5krKsY4nNrYS5E
YoT5Vkwg
=T+Sx
-----END PGP SIGNATURE-----

gpgv: Signature made Wed Mar 19 10:27:26 2025 UTC
gpgv:                using RSA key 64FBB79F5EAE64D792E94CFE0716F00F842CD274
gpgv: Can't check signature: No public key
dpkg-source: warning: cannot verify inline signature for ./yhkylin-backup-tools_4.1.0.1-ok17.dsc: no acceptable signature found
dpkg-source: info: extracting yhkylin-backup-tools in /<<PKGBUILDDIR>>
dpkg-source: info: unpacking yhkylin-backup-tools_4.1.0.1-ok17.tar.xz

Check disk space
----------------

Sufficient free space for build

User Environment
----------------

APT_CONFIG=/var/lib/sbuild/apt.conf
DEB_BUILD_OPTIONS=noautodbgsym parallel=16
HOME=/sbuild-nonexistent
LANG=C.UTF-8
LC_ALL=C.UTF-8
LOGNAME=buildd
PATH=/usr/local/sbin:/usr/local/bin:/usr/sbin:/usr/bin:/sbin:/bin:/usr/games
SCHROOT_ALIAS_NAME=build-PACKAGEBUILD-288571
SCHROOT_CHROOT_NAME=build-PACKAGEBUILD-288571
SCHROOT_COMMAND=env
SCHROOT_GID=2501
SCHROOT_GROUP=buildd
SCHROOT_SESSION_ID=build-PACKAGEBUILD-288571
SCHROOT_UID=2001
SCHROOT_USER=buildd
SHELL=/bin/sh
TERM=unknown
USER=buildd
V=1

dpkg-buildpackage
-----------------

Command: dpkg-buildpackage -us -uc -mLaunchpad Build Daemon <buildd@2f6cb779b462> -b -rfakeroot
dpkg-buildpackage: info: source package yhkylin-backup-tools
dpkg-buildpackage: info: source version 4.1.0.1-ok17
dpkg-buildpackage: info: source distribution nile
 dpkg-source --before-build .
dpkg-buildpackage: info: host architecture amd64
 fakeroot debian/rules clean
dh clean
dh: warning: Compatibility levels before 10 are deprecated (level 9 in use)
   dh_auto_clean
dh_auto_clean: warning: Compatibility levels before 10 are deprecated (level 9 in use)
   dh_clean
dh_clean: warning: Compatibility levels before 10 are deprecated (level 9 in use)
 debian/rules build
dh build
dh: warning: Compatibility levels before 10 are deprecated (level 9 in use)
   dh_update_autotools_config
   dh_auto_configure
dh_auto_configure: warning: Compatibility levels before 10 are deprecated (level 9 in use)
	qmake -makefile "QMAKE_CFLAGS_RELEASE=-g -O2 -ffile-prefix-map=/<<PKGBUILDDIR>>=. -flto=auto -ffat-lto-objects -flto=auto -ffat-lto-objects -fstack-protector-strong -Wformat -Werror=format-security -Wdate-time -D_FORTIFY_SOURCE=2" "QMAKE_CFLAGS_DEBUG=-g -O2 -ffile-prefix-map=/<<PKGBUILDDIR>>=. -flto=auto -ffat-lto-objects -flto=auto -ffat-lto-objects -fstack-protector-strong -Wformat -Werror=format-security -Wdate-time -D_FORTIFY_SOURCE=2" "QMAKE_CXXFLAGS_RELEASE=-g -O2 -ffile-prefix-map=/<<PKGBUILDDIR>>=. -flto=auto -ffat-lto-objects -flto=auto -ffat-lto-objects -fstack-protector-strong -Wformat -Werror=format-security -Wdate-time -D_FORTIFY_SOURCE=2" "QMAKE_CXXFLAGS_DEBUG=-g -O2 -ffile-prefix-map=/<<PKGBUILDDIR>>=. -flto=auto -ffat-lto-objects -flto=auto -ffat-lto-objects -fstack-protector-strong -Wformat -Werror=format-security -Wdate-time -D_FORTIFY_SOURCE=2" "QMAKE_LFLAGS_RELEASE=-flto=auto -ffat-lto-objects -flto=auto -Wl,-z,relro" "QMAKE_LFLAGS_DEBUG=-flto=auto -ffat-lto-objects -flto=auto -Wl,-z,relro" QMAKE_STRIP=: PREFIX=/usr
Info: creating stash file /<<PKGBUILDDIR>>/.qmake.stash
   dh_auto_build
dh_auto_build: warning: Compatibility levels before 10 are deprecated (level 9 in use)
	make -j1
make[1]: Entering directory '/<<PKGBUILDDIR>>'
cd kybackup/ && ( test -e Makefile || /usr/lib/qt5/bin/qmake -o Makefile /<<PKGBUILDDIR>>/kybackup/kybackup.pro 'QMAKE_CFLAGS_RELEASE=-g -O2 -ffile-prefix-map=/<<PKGBUILDDIR>>=. -flto=auto -ffat-lto-objects -flto=auto -ffat-lto-objects -fstack-protector-strong -Wformat -Werror=format-security -Wdate-time -D_FORTIFY_SOURCE=2' 'QMAKE_CFLAGS_DEBUG=-g -O2 -ffile-prefix-map=/<<PKGBUILDDIR>>=. -flto=auto -ffat-lto-objects -flto=auto -ffat-lto-objects -fstack-protector-strong -Wformat -Werror=format-security -Wdate-time -D_FORTIFY_SOURCE=2' 'QMAKE_CXXFLAGS_RELEASE=-g -O2 -ffile-prefix-map=/<<PKGBUILDDIR>>=. -flto=auto -ffat-lto-objects -flto=auto -ffat-lto-objects -fstack-protector-strong -Wformat -Werror=format-security -Wdate-time -D_FORTIFY_SOURCE=2' 'QMAKE_CXXFLAGS_DEBUG=-g -O2 -ffile-prefix-map=/<<PKGBUILDDIR>>=. -flto=auto -ffat-lto-objects -flto=auto -ffat-lto-objects -fstack-protector-strong -Wformat -Werror=format-security -Wdate-time -D_FORTIFY_SOURCE=2' 'QMAKE_LFLAGS_RELEASE=-flto=auto -ffat-lto-objects -flto=auto -Wl,-z,relro' 'QMAKE_LFLAGS_DEBUG=-flto=auto -ffat-lto-objects -flto=auto -Wl,-z,relro' QMAKE_STRIP=: PREFIX=/usr ) && make -f Makefile 
Project MESSAGE: Updating 'qt_ar.qm'... Generated 363 translation(s) (363 finished and 0 unfinished) Updating 'qt_bo_CN.qm'... Generated 363 translation(s) (360 finished and 3 unfinished) Updating 'qt_de.qm'... Generated 362 translation(s) (362 finished and 0 unfinished) Updating 'qt_es.qm'... Generated 362 translation(s) (362 finished and 0 unfinished) Updating 'qt_fr.qm'... Generated 362 translation(s) (362 finished and 0 unfinished) Updating 'qt_kk.qm'... Generated 363 translation(s) (363 finished and 0 unfinished) Updating 'qt_ky.qm'... Generated 363 translation(s) (363 finished and 0 unfinished) Updating 'qt_mn.qm'... Generated 353 translation(s) (353 finished and 0 unfinished) Ignored 2 untranslated source text(s) Updating 'qt_ug.qm'... Generated 363 translation(s) (363 finished and 0 unfinished) Updating 'qt_vi.qm'... Generated 363 translation(s) (363 finished and 0 unfinished) Updating 'qt_zh_CN.qm'... Generated 363 translation(s) (362 finished and 1 unfinished) Updating 'qt_zh_HK.qm'... Generated 362 translation(s) (362 finished and 0 unfinished)
Project ERROR: kysdk-soundeffects development package not found
make[1]: *** [Makefile:48: sub-kybackup-make_first-ordered] Error 3
make[1]: Leaving directory '/<<PKGBUILDDIR>>'
dh_auto_build: error: make -j1 returned exit code 2
make: *** [debian/rules:22: build] Error 255
dpkg-buildpackage: error: debian/rules build subprocess returned exit status 2
--------------------------------------------------------------------------------
Build finished at 2025-03-20T09:28:00Z

Finished
--------


+------------------------------------------------------------------------------+
| Cleanup                                                                      |
+------------------------------------------------------------------------------+

Purging /<<BUILDDIR>>
Not removing build depends: as requested
E: Build failure (dpkg-buildpackage died)

+------------------------------------------------------------------------------+
| Summary                                                                      |
+------------------------------------------------------------------------------+

Build Architecture: amd64
Build Type: binary
Build-Space: 7276
Build-Time: 6
Distribution: nile
Fail-Stage: build
Host Architecture: amd64
Install-Time: 101
Job: yhkylin-backup-tools_4.1.0.1-ok17.dsc
Machine Architecture: amd64
Package: yhkylin-backup-tools
Package-Time: 109
Source-Version: 4.1.0.1-ok17
Space: 7276
Status: attempted
Version: 4.1.0.1-ok17
--------------------------------------------------------------------------------
Finished at 2025-03-20T09:28:00Z
Build needed 00:01:49, 7276k disk space
E: Build failure (dpkg-buildpackage died)
Adding user buildd to group lxd
RUN: /usr/share/launchpad-buildd/bin/in-target scan-for-processes --backend=chroot --series=nile --arch=amd64 PACKAGEBUILD-288571
Scanning for processes to kill in build PACKAGEBUILD-288571
RUN: /usr/share/launchpad-buildd/bin/in-target umount-chroot --backend=chroot --series=nile --arch=amd64 PACKAGEBUILD-288571
Stopping target for build PACKAGEBUILD-288571
RUN: /usr/share/launchpad-buildd/bin/in-target remove-build --backend=chroot --series=nile --arch=amd64 PACKAGEBUILD-288571
Removing build PACKAGEBUILD-288571